jena-commits mailing list archives

Site index · List index
Message view « Date » · « Thread »
Top « Date » · « Thread »
From Apache Jenkins Server <jenk...@builds.apache.org>
Subject Build failed in Jenkins: Jena_Development_Deploy #669
Date Wed, 13 Aug 2014 08:26:27 GMT
See <https://builds.apache.org/job/Jena_Development_Deploy/669/changes>

Changes:

[rvesse] Make TransformQuadGraph a public class (JENA-763)

------------------------------------------
Started by an SCM change
Building remotely on ubuntu3 (Ubuntu ubuntu) in workspace <https://builds.apache.org/job/Jena_Development_Deploy/ws/>
Cleaning up <https://builds.apache.org/job/Jena_Development_Deploy/ws/trunk>
Deleting <https://builds.apache.org/job/Jena_Development_Deploy/ws/trunk/target>
Deleting <https://builds.apache.org/job/Jena_Development_Deploy/ws/trunk/jena-arq/target>
Deleting <https://builds.apache.org/job/Jena_Development_Deploy/ws/trunk/jena-iri/target>
Deleting <https://builds.apache.org/job/Jena_Development_Deploy/ws/trunk/jena-spatial/target>
Deleting <https://builds.apache.org/job/Jena_Development_Deploy/ws/trunk/jena-parent/target>
Deleting <https://builds.apache.org/job/Jena_Development_Deploy/ws/trunk/jena-text/DB>
Deleting <https://builds.apache.org/job/Jena_Development_Deploy/ws/trunk/jena-text/target>
Deleting <https://builds.apache.org/job/Jena_Development_Deploy/ws/trunk/apache-jena/target>
Deleting <https://builds.apache.org/job/Jena_Development_Deploy/ws/trunk/apache-jena-libs/target>
Deleting <https://builds.apache.org/job/Jena_Development_Deploy/ws/trunk/jena-sdb/target>
Deleting <https://builds.apache.org/job/Jena_Development_Deploy/ws/trunk/jena-tdb/target>
Deleting <https://builds.apache.org/job/Jena_Development_Deploy/ws/trunk/jena-jdbc/target>
Deleting <https://builds.apache.org/job/Jena_Development_Deploy/ws/trunk/jena-jdbc/jena-jdbc-driver-tdb/target>
Deleting <https://builds.apache.org/job/Jena_Development_Deploy/ws/trunk/jena-jdbc/jena-jdbc-core/target>
Deleting <https://builds.apache.org/job/Jena_Development_Deploy/ws/trunk/jena-jdbc/jena-jdbc-driver-mem/target>
Deleting <https://builds.apache.org/job/Jena_Development_Deploy/ws/trunk/jena-jdbc/jena-jdbc-driver-bundle/target>
Deleting <https://builds.apache.org/job/Jena_Development_Deploy/ws/trunk/jena-jdbc/jena-jdbc-driver-remote/target>
Deleting <https://builds.apache.org/job/Jena_Development_Deploy/ws/trunk/jena-maven-tools/target>
Deleting <https://builds.apache.org/job/Jena_Development_Deploy/ws/trunk/jena-core/target>
Deleting <https://builds.apache.org/job/Jena_Development_Deploy/ws/trunk/jena-fuseki/target>
Deleting <https://builds.apache.org/job/Jena_Development_Deploy/ws/trunk/jena-security/target>
Updating http://svn.apache.org/repos/asf/jena/trunk at revision '2014-08-13T08:21:05.512 +0000'
U         jena-arq/src/main/java/com/hp/hpl/jena/sparql/algebra/AlgebraQuad.java
A         jena-arq/src/main/java/com/hp/hpl/jena/sparql/algebra/TransformQuadGraph.java
At revision 1617680
Parsing POMs
maven31-agent.jar already up to date
maven31-interceptor.jar already up to date
maven3-interceptor-commons.jar already up to date
[trunk] $ /home/jenkins/tools/java/latest1.7/bin/java -Xrs -cp /home/jenkins/jenkins-slave/maven31-agent.jar:/home/jenkins/jenkins-slave/tools/hudson.tasks.Maven_MavenInstallation/maven-3.1.1/boot/plexus-classworlds-2.5.1.jar:/home/jenkins/jenkins-slave/tools/hudson.tasks.Maven_MavenInstallation/maven-3.1.1/conf/logging
jenkins.maven3.agent.Maven31Main /home/jenkins/jenkins-slave/tools/hudson.tasks.Maven_MavenInstallation/maven-3.1.1
/x1/jenkins/jenkins-slave/slave.jar /home/jenkins/jenkins-slave/maven31-interceptor.jar /home/jenkins/jenkins-slave/maven3-interceptor-commons.jar
50092
<===[JENKINS REMOTING CAPACITY]channel started
===>   log4j:WARN No appenders could be found for logger (org.apache.commons.beanutils.converters.BooleanConverter).
log4j:WARN Please initialize the log4j system properly.
Executing Maven:  -B -f <https://builds.apache.org/job/Jena_Development_Deploy/ws/trunk/pom.xml>
-Dmaven.repo.local=/home/jenkins/jenkins-slave/maven-repositories/1 clean deploy
[INFO] Scanning for projects...
[INFO] ------------------------------------------------------------------------
[INFO] Reactor Build Order:
[INFO] 
[INFO] Apache Jena - Parent
[INFO] Apache Jena - IRI
[INFO] Apache Jena - Core
[INFO] Apache Jena - ARQ (SPARQL 1.1 Query Engine)
[INFO] Apache Jena - TDB (Native Triple Store)
[INFO] Apache Jena - Libraries POM
[INFO] Apache Jena - SPARQL Text Search
[INFO] Apache Jena - SPARQL Spatial Search
[INFO] Apache Jena - SDB (SQL based triple store)
[INFO] Apache Jena - Fuseki (SPARQL 1.1 Server)
[INFO] Apache Jena - Security
[INFO] Apache Jena - JDBC Parent
[INFO] Apache Jena - JDBC Core API
[INFO] Apache Jena - JDBC Remote Endpoint Driver
[INFO] Apache Jena - JDBC In-Memory Driver
[INFO] Apache Jena - JDBC TDB Driver
[INFO] Apache Jena - JDBC Driver Bundle
[INFO] Apache Jena - Maven Plugins, including schemagen
[INFO] Apache Jena - Distribution
[INFO] Apache Jena
[INFO]                                                                         
[INFO] ------------------------------------------------------------------------
[INFO] Building Apache Jena - Parent 11-SNAPSHOT
[INFO] ------------------------------------------------------------------------
[INFO] 
[INFO] --- maven-clean-plugin:2.5:clean (default-clean) @ jena-parent ---
[INFO] 
[INFO] --- maven-enforcer-plugin:1.3.1:enforce (enforce) @ jena-parent ---
[INFO] 
[INFO] --- maven-enforcer-plugin:1.3.1:enforce (enforce-java) @ jena-parent ---
[INFO] 
[INFO] --- maven-remote-resources-plugin:1.5:process (default) @ jena-parent ---
[INFO] 
[INFO] --- maven-site-plugin:3.3:attach-descriptor (attach-descriptor) @ jena-parent ---
[INFO] 
[INFO] --- maven-install-plugin:2.5.1:install (default-install) @ jena-parent ---
[INFO] Installing <https://builds.apache.org/job/Jena_Development_Deploy/ws/trunk/jena-parent/pom.xml>
to /home/jenkins/jenkins-slave/maven-repositories/1/org/apache/jena/jena-parent/11-SNAPSHOT/jena-parent-11-SNAPSHOT.pom
[INFO] 
[INFO] --- maven-deploy-plugin:2.8.1:deploy (default-deploy) @ jena-parent ---
[INFO] Downloading: https://repository.apache.org/content/repositories/snapshots/org/apache/jena/jena-parent/11-SNAPSHOT/maven-metadata.xml
[WARNING] Checksum validation failed, could not read expected checksum: Failed to transfer
file: https://repository.apache.org/content/repositories/snapshots/org/apache/jena/jena-parent/11-SNAPSHOT/maven-metadata.xml.sha1.
Return code is: 502 , ReasonPhrase:Proxy Error. for https://repository.apache.org/content/repositories/snapshots/org/apache/jena/jena-parent/11-SNAPSHOT/maven-metadata.xml
[INFO] Downloaded: https://repository.apache.org/content/repositories/snapshots/org/apache/jena/jena-parent/11-SNAPSHOT/maven-metadata.xml
(599 B at 0.0 KB/sec)
[INFO] Uploading: https://repository.apache.org/content/repositories/snapshots/org/apache/jena/jena-parent/11-SNAPSHOT/jena-parent-11-20140813.082420-14.pom
[INFO] Uploaded: https://repository.apache.org/content/repositories/snapshots/org/apache/jena/jena-parent/11-SNAPSHOT/jena-parent-11-20140813.082420-14.pom
(19 KB at 0.3 KB/sec)
[INFO] Downloading: https://repository.apache.org/content/repositories/snapshots/org/apache/jena/jena-parent/maven-metadata.xml
[WARNING] Could not transfer metadata org.apache.jena:jena-parent/maven-metadata.xml from/to
apache.snapshots.https (https://repository.apache.org/content/repositories/snapshots): Failed
to transfer file: https://repository.apache.org/content/repositories/snapshots/org/apache/jena/jena-parent/maven-metadata.xml.
Return code is: 502 , ReasonPhrase:Proxy Error.
[JENKINS] Archiving disabled
[JENKINS] Archiving disabled
[JENKINS] Archiving disabled
[JENKINS] Archiving disabled
[JENKINS] Archiving disabled
[JENKINS] Archiving disabled
[JENKINS] Archiving disabled
[JENKINS] Archiving disabled
[JENKINS] Archiving disabled
[JENKINS] Archiving disabled
[JENKINS] Archiving disabled
[JENKINS] Archiving disabled
[JENKINS] Archiving disabled
[JENKINS] Archiving disabled
[JENKINS] Archiving disabled
[JENKINS] Archiving disabled
[JENKINS] Archiving disabled
[JENKINS] Archiving disabled
[JENKINS] Archiving disabled
[JENKINS] Archiving disabled
[JENKINS] Archiving disabled
[INFO] ------------------------------------------------------------------------
[INFO] Reactor Summary:
[INFO] 
[INFO] Apache Jena - Parent .............................. FAILURE [4:35.559s]
[INFO] Apache Jena - IRI ................................. SKIPPED
[INFO] Apache Jena - Core ................................ SKIPPED
[INFO] Apache Jena - ARQ (SPARQL 1.1 Query Engine) ....... SKIPPED
[INFO] Apache Jena - TDB (Native Triple Store) ........... SKIPPED
[INFO] Apache Jena - Libraries POM ....................... SKIPPED
[INFO] Apache Jena - SPARQL Text Search .................. SKIPPED
[INFO] Apache Jena - SPARQL Spatial Search ............... SKIPPED
[INFO] Apache Jena - SDB (SQL based triple store) ........ SKIPPED
[INFO] Apache Jena - Fuseki (SPARQL 1.1 Server) .......... SKIPPED
[INFO] Apache Jena - Security ............................ SKIPPED
[INFO] Apache Jena - JDBC Parent ......................... SKIPPED
[INFO] Apache Jena - JDBC Core API ....................... SKIPPED
[INFO] Apache Jena - JDBC Remote Endpoint Driver ......... SKIPPED
[INFO] Apache Jena - JDBC In-Memory Driver ............... SKIPPED
[INFO] Apache Jena - JDBC TDB Driver ..................... SKIPPED
[INFO] Apache Jena - JDBC Driver Bundle .................. SKIPPED
[INFO] Apache Jena - Maven Plugins, including schemagen .. SKIPPED
[INFO] Apache Jena - Distribution ........................ SKIPPED
[INFO] Apache Jena ....................................... SKIPPED
[INFO] ------------------------------------------------------------------------
[INFO] BUILD FAILURE
[INFO] ------------------------------------------------------------------------
[INFO] Total time: 4:39.488s
[INFO] Finished at: Wed Aug 13 08:26:20 UTC 2014
[INFO] Final Memory: 19M/90M
[INFO] ------------------------------------------------------------------------
[ERROR] Failed to execute goal org.apache.maven.plugins:maven-deploy-plugin:2.8.1:deploy (default-deploy)
on project jena-parent: Failed to retrieve remote metadata org.apache.jena:jena-parent/maven-metadata.xml:
Could not transfer metadata org.apache.jena:jena-parent/maven-metadata.xml from/to apache.snapshots.https
(https://repository.apache.org/content/repositories/snapshots): Failed to transfer file: https://repository.apache.org/content/repositories/snapshots/org/apache/jena/jena-parent/maven-metadata.xml.
Return code is: 502 , ReasonPhrase:Proxy Error. -> [Help 1]
[ERROR] 
[ERROR] To see the full stack trace of the errors, re-run Maven with the -e switch.
[ERROR] Re-run Maven using the -X switch to enable full debug logging.
[ERROR] 
[ERROR] For more information about the errors and possible solutions, please read the following
articles:
[ERROR] [Help 1] http://cwiki.apache.org/confluence/display/MAVEN/MojoExecutionException
Sending e-mails to: commits@jena.apache.org
channel stopped

Mime
View raw message