jena-commits mailing list archives

Site index · List index
Message view « Date » · « Thread »
Top « Date » · « Thread »
From Apache Jenkins Server <jenk...@builds.apache.org>
Subject Build failed in Jenkins: Jena_Development_Test_Java8 #4
Date Thu, 12 Jun 2014 18:44:46 GMT
See <https://builds.apache.org/job/Jena_Development_Test_Java8/4/changes>

Changes:

[andy] Make public a counting StreamRDF implementation.

[andy] Make toString clearer

[andy] Deprecate.

------------------------------------------
Started by an SCM change
Building remotely on ubuntu3 (Ubuntu ubuntu) in workspace <https://builds.apache.org/job/Jena_Development_Test_Java8/ws/>
Cleaning up <https://builds.apache.org/job/Jena_Development_Test_Java8/ws/trunk>
Deleting <https://builds.apache.org/job/Jena_Development_Test_Java8/ws/trunk/jena-arq/target>
Deleting <https://builds.apache.org/job/Jena_Development_Test_Java8/ws/trunk/jena-iri/target>
Deleting <https://builds.apache.org/job/Jena_Development_Test_Java8/ws/trunk/jena-parent/target>
Deleting <https://builds.apache.org/job/Jena_Development_Test_Java8/ws/trunk/jena-core/target>
Updating http://svn.apache.org/repos/asf/jena/trunk at revision '2014-06-12T18:43:15.461 +0000'
U         jena-tdb/src/main/java/com/hp/hpl/jena/tdb/base/file/LocationLock.java
U         jena-tdb/src/main/java/com/hp/hpl/jena/tdb/base/file/Location.java
AU        jena-arq/src/test/java/org/apache/jena/riot/system/TestStreamRDF.java
U         jena-arq/src/test/java/org/apache/jena/riot/system/TS_RiotSystem.java
U         jena-arq/src/main/java/org/apache/jena/atlas/lib/MultiMap.java
U         jena-arq/src/main/java/org/apache/jena/riot/lang/StreamRDFCounting.java
AU        jena-arq/src/main/java/org/apache/jena/riot/system/StreamRDFCountingBase.java
U         jena-arq/src/main/java/org/apache/jena/riot/system/StreamRDFLib.java
U         jena-arq/ReleaseNotes.txt
U         jena-core/src/main/java/com/hp/hpl/jena/graph/impl/GraphAddList.java
At revision 1602259
Parsing POMs
maven31-agent.jar already up to date
maven31-interceptor.jar already up to date
maven3-interceptor-commons.jar already up to date
[trunk] $ /home/jenkins/tools/java/jdk1.8.0/bin/java -Xrs -cp /home/jenkins/jenkins-slave/maven31-agent.jar:/home/jenkins/jenkins-slave/tools/hudson.tasks.Maven_MavenInstallation/maven-3.1.1/boot/plexus-classworlds-2.5.1.jar:/home/jenkins/jenkins-slave/tools/hudson.tasks.Maven_MavenInstallation/maven-3.1.1/conf/logging
jenkins.maven3.agent.Maven31Main /home/jenkins/jenkins-slave/tools/hudson.tasks.Maven_MavenInstallation/maven-3.1.1
/x1/jenkins/jenkins-slave/slave.jar /home/jenkins/jenkins-slave/maven31-interceptor.jar /home/jenkins/jenkins-slave/maven3-interceptor-commons.jar
39925
<===[JENKchannel started
INS REMOTING CAPACITY]===>   log4j:WARN No appenders could be found for logger (org.apache.commons.beanutils.converters.BooleanConverter).
log4j:WARN Please initialize the log4j system properly.
Executing Maven:  -B -f <https://builds.apache.org/job/Jena_Development_Test_Java8/ws/trunk/pom.xml>
-Dmaven.repo.local=/home/jenkins/jenkins-slave/maven-repositories/0 clean test
[INFO] Scanning for projects...
[INFO] ------------------------------------------------------------------------
[INFO] Reactor Build Order:
[INFO] 
[INFO] Apache Jena - Parent
[INFO] Apache Jena - IRI
[INFO] Apache Jena - Core
[INFO] Apache Jena - ARQ (SPARQL 1.1 Query Engine)
[INFO] Apache Jena - TDB (Native Triple Store)
[INFO] Apache Jena - Libraries POM
[INFO] Apache Jena - SPARQL Text Search
[INFO] Apache Jena - SPARQL Spatial Search
[INFO] Apache Jena - SDB (SQL based triple store)
[INFO] Apache Jena - Fuseki (SPARQL 1.1 Server)
[INFO] Apache Jena - Security
[INFO] Apache Jena - JDBC Parent
[INFO] Apache Jena - JDBC Core API
[INFO] Apache Jena - JDBC Remote Endpoint Driver
[INFO] Apache Jena - JDBC In-Memory Driver
[INFO] Apache Jena - JDBC TDB Driver
[INFO] Apache Jena - JDBC Driver Bundle
[INFO] Apache Jena - Maven Plugins, including schemagen
[INFO] Apache Jena - Distribution
[INFO] Apache Jena
[INFO]                                                                         
[INFO] ------------------------------------------------------------------------
[INFO] Building Apache Jena - Parent 10-SNAPSHOT
[INFO] ------------------------------------------------------------------------
[INFO] 
[INFO] --- maven-clean-plugin:2.5:clean (default-clean) @ jena-parent ---
[INFO] 
[INFO] --- maven-enforcer-plugin:1.2:enforce (enforce) @ jena-parent ---
[INFO] 
[INFO] --- maven-enforcer-plugin:1.2:enforce (enforce-java) @ jena-parent ---
[INFO] 
[INFO] --- maven-remote-resources-plugin:1.5:process (default) @ jena-parent ---
[JENKINS] Archiving disabled
[INFO]                                                                         
[INFO] ------------------------------------------------------------------------
[INFO] Building Apache Jena - IRI 1.1.0-SNAPSHOT
[INFO] ------------------------------------------------------------------------
[INFO] 
[INFO] --- maven-clean-plugin:2.5:clean (default-clean) @ jena-iri ---
[INFO] 
[INFO] --- maven-enforcer-plugin:1.2:enforce (enforce) @ jena-iri ---
[INFO] 
[INFO] --- maven-enforcer-plugin:1.2:enforce (enforce-java) @ jena-iri ---
[INFO] 
[INFO] --- maven-remote-resources-plugin:1.5:process (default) @ jena-iri ---
[INFO] 
[INFO] --- maven-resources-plugin:2.6:resources (default-resources) @ jena-iri ---
[INFO] Using 'UTF-8' encoding to copy filtered resources.
[INFO] Copying 0 resource
[INFO] Copying 3 resources
[INFO] 
[INFO] --- maven-compiler-plugin:3.1:compile (default-compile) @ jena-iri ---
[INFO] Changes detected - recompiling the module!
[INFO] Compiling 44 source files to <https://builds.apache.org/job/Jena_Development_Test_Java8/ws/trunk/jena-iri/target/classes>
[INFO] 
[INFO] --- maven-resources-plugin:2.6:testResources (default-testResources) @ jena-iri ---
[INFO] Using 'UTF-8' encoding to copy filtered resources.
[INFO] Copying 4 resources
[INFO] Copying 3 resources
[INFO] 
[INFO] --- maven-compiler-plugin:3.1:testCompile (default-testCompile) @ jena-iri ---
[INFO] Changes detected - recompiling the module!
[INFO] Compiling 22 source files to <https://builds.apache.org/job/Jena_Development_Test_Java8/ws/trunk/jena-iri/target/test-classes>
[INFO] 
[INFO] --- maven-surefire-plugin:2.15:test (default-test) @ jena-iri ---
[INFO] Surefire report directory: <https://builds.apache.org/job/Jena_Development_Test_Java8/ws/trunk/jena-iri/target/surefire-reports>

-------------------------------------------------------
 T E S T S
-------------------------------------------------------
Running org.apache.jena.iri.test.TestPackage
Tests run: 1297, Failures: 0, Errors: 0, Skipped: 0, Time elapsed: 1.429 sec - in org.apache.jena.iri.test.TestPackage

Results :

Tests run: 1297, Failures: 0, Errors: 0, Skipped: 0

[JENKINS] Recording test results
[JENKINS] Archiving disabled
[INFO]                                                                         
[INFO] ------------------------------------------------------------------------
[INFO] Building Apache Jena - Core 2.12.0-SNAPSHOT
[INFO] ------------------------------------------------------------------------
[INFO] 
[INFO] --- maven-clean-plugin:2.5:clean (default-clean) @ jena-core ---
[INFO] 
[INFO] --- maven-enforcer-plugin:1.2:enforce (enforce) @ jena-core ---
[INFO] 
[INFO] --- maven-enforcer-plugin:1.2:enforce (enforce-java) @ jena-core ---
[INFO] 
[INFO] --- maven-remote-resources-plugin:1.5:process (default) @ jena-core ---
[INFO] 
[INFO] --- maven-resources-plugin:2.6:resources (default-resources) @ jena-core ---
[INFO] Using 'UTF-8' encoding to copy filtered resources.
[INFO] Copying 2 resources to etc
[INFO] Copying 19 resources
[INFO] Copying 1 resource
[INFO] Copying 3 resources
[INFO] 
[INFO] --- maven-compiler-plugin:3.1:compile (default-compile) @ jena-core ---
[INFO] Changes detected - recompiling the module!
[INFO] Compiling 748 source files to <https://builds.apache.org/job/Jena_Development_Test_Java8/ws/trunk/jena-core/target/classes>
[WARNING] <https://builds.apache.org/job/Jena_Development_Test_Java8/ws/trunk/jena-core/src/main/java/com/hp/hpl/jena/rdf/model/impl/ModelReifier.java>:
Some input files use or override a deprecated API.
[WARNING] <https://builds.apache.org/job/Jena_Development_Test_Java8/ws/trunk/jena-core/src/main/java/com/hp/hpl/jena/rdf/model/impl/ModelReifier.java>:
Recompile with -Xlint:deprecation for details.
[INFO] 
[INFO] --- maven-resources-plugin:2.6:testResources (default-testResources) @ jena-core ---
[INFO] Using 'UTF-8' encoding to copy filtered resources.
[INFO] Copying 33 resources
[INFO] Copying 3 resources
[INFO] 
[INFO] --- maven-compiler-plugin:3.1:testCompile (default-testCompile) @ jena-core ---
[INFO] Changes detected - recompiling the module!
[INFO] Compiling 349 source files to <https://builds.apache.org/job/Jena_Development_Test_Java8/ws/trunk/jena-core/target/test-classes>
[WARNING] <https://builds.apache.org/job/Jena_Development_Test_Java8/ws/trunk/jena-core/src/test/java/com/hp/hpl/jena/graph/compose/test/TestDelta.java>:
Some input files use or override a deprecated API.
[WARNING] <https://builds.apache.org/job/Jena_Development_Test_Java8/ws/trunk/jena-core/src/test/java/com/hp/hpl/jena/graph/compose/test/TestDelta.java>:
Recompile with -Xlint:deprecation for details.
[INFO] 
[INFO] --- maven-surefire-plugin:2.15:test (default-test) @ jena-core ---
[INFO] Surefire report directory: <https://builds.apache.org/job/Jena_Development_Test_Java8/ws/trunk/jena-core/target/surefire-reports>

-------------------------------------------------------
 T E S T S
-------------------------------------------------------
Running com.hp.hpl.jena.test.TestPackage
Tests run: 8667, Failures: 0, Errors: 0, Skipped: 0, Time elapsed: 26.241 sec - in com.hp.hpl.jena.test.TestPackage

Results :

Tests run: 8667, Failures: 0, Errors: 0, Skipped: 0

[JENKINS] Recording test results
[JENKINS] Archiving disabled
[INFO]                                                                         
[INFO] ------------------------------------------------------------------------
[INFO] Building Apache Jena - ARQ (SPARQL 1.1 Query Engine) 2.12.0-SNAPSHOT
[INFO] ------------------------------------------------------------------------
[INFO] 
[INFO] --- maven-clean-plugin:2.5:clean (default-clean) @ jena-arq ---
[INFO] 
[INFO] --- maven-enforcer-plugin:1.2:enforce (enforce) @ jena-arq ---
[INFO] 
[INFO] --- maven-enforcer-plugin:1.2:enforce (enforce-java) @ jena-arq ---
[INFO] 
[INFO] --- maven-remote-resources-plugin:1.5:process (default) @ jena-arq ---
[JENKINS] Archiving disabled
[JENKINS] Archiving disabled
[JENKINS] Archiving disabled
[JENKINS] Archiving disabled
[JENKINS] Archiving disabled
[JENKINS] Archiving disabled
[JENKINS] Archiving disabled
[JENKINS] Archiving disabled
[JENKINS] Archiving disabled
[JENKINS] Archiving disabled
[JENKINS] Archiving disabled
[JENKINS] Archiving disabled
[JENKINS] Archiving disabled
[JENKINS] Archiving disabled
[JENKINS] Archiving disabled
[JENKINS] Archiving disabled
[JENKINS] Archiving disabled
[JENKINS] Archiving disabled
[JENKINS] Archiving disabled
[JENKINS] Archiving disabled
[JENKINS] Archiving disabled[INFO] ------------------------------------------------------------------------
[INFO] Reactor Summary:
[INFO] 
[INFO] Apache Jena - Parent .............................. SUCCESS [5.945s]
[INFO] Apache Jena - IRI ................................. SUCCESS [6.398s]
[INFO] Apache Jena - Core ................................ SUCCESS [38.629s]
[INFO] Apache Jena - ARQ (SPARQL 1.1 Query Engine) ....... FAILURE [0.489s]
[INFO] Apache Jena - TDB (Native Triple Store) ........... SKIPPED
[INFO] Apache Jena - Libraries POM ....................... SKIPPED
[INFO] Apache Jena - SPARQL Text Search .................. SKIPPED
[INFO] Apache Jena - SPARQL Spatial Search ............... SKIPPED
[INFO] Apache Jena - SDB (SQL based triple store) ........ SKIPPED
[INFO] Apache Jena - Fuseki (SPARQL 1.1 Server) .......... SKIPPED
[INFO] Apache Jena - Security ............................ SKIPPED
[INFO] Apache Jena - JDBC Parent ......................... SKIPPED
[INFO] Apache Jena - JDBC Core API ....................... SKIPPED
[INFO] Apache Jena - JDBC Remote Endpoint Driver ......... SKIPPED
[INFO] Apache Jena - JDBC In-Memory Driver ............... SKIPPED
[INFO] Apache Jena - JDBC TDB Driver ..................... SKIPPED
[INFO] Apache Jena - JDBC Driver Bundle .................. SKIPPED
[INFO] Apache Jena - Maven Plugins, including schemagen .. SKIPPED
[INFO] Apache Jena - Distribution ........................ SKIPPED
[INFO] Apache Jena ....................................... SKIPPED
[INFO] ------------------------------------------------------------------------
[INFO] BUILD FAILURE
[INFO] ------------------------------------------------------------------------
[INFO] Total time: 57.203s
[INFO] Finished at: Thu Jun 12 18:44:37 UTC 2014

[INFO] Final Memory: 32M/217M
[INFO] ------------------------------------------------------------------------
[ERROR] Failed to execute goal org.apache.maven.plugins:maven-remote-resources-plugin:1.5:process
(default) on project jena-arq: Error rendering velocity resource. NullPointerException ->
[Help 1]
[ERROR] 
[ERROR] To see the full stack trace of the errors, re-run Maven with the -e switch.
[ERROR] Re-run Maven using the -X switch to enable full debug logging.
[ERROR] 
[ERROR] For more information about the errors and possible solutions, please read the following
articles:
[ERROR] [Help 1] http://cwiki.apache.org/confluence/display/MAVEN/MojoExecutionException
[ERROR] 
[ERROR] After correcting the problems, you can resume the build with the command
[ERROR]   mvn <goals> -rf :jena-arq
Sending e-mails to: commits@jena.apache.org
channel stopped

Mime
View raw message