jena-commits mailing list archives

Site index · List index
Message view « Date » · « Thread »
Top « Date » · « Thread »
From Apache Jenkins Server <jenk...@builds.apache.org>
Subject Build failed in Jenkins: Jena_Development_Deploy #627
Date Fri, 20 Jun 2014 08:10:04 GMT
See <https://builds.apache.org/job/Jena_Development_Deploy/627/changes>

Changes:

[andy] Remove unnecessary plugin (comes via parent anyway)

[andy] Remove version numbers where derived from the Apache POM parent

------------------------------------------
[...truncated 1058 lines...]
[INFO] Including log4j:log4j:jar:1.2.17 in the shaded jar.
[INFO] Attaching shaded artifact.
[INFO] 
[INFO] --- maven-assembly-plugin:2.4:single (create-zip-assembly) @ jena-fuseki ---
[INFO] Reading assembly descriptor: assembly-dist.xml
[INFO] Building zip: <https://builds.apache.org/job/Jena_Development_Deploy/ws/trunk/jena-fuseki/target/jena-fuseki-1.1.0-SNAPSHOT-distribution.zip>
[INFO] Building tar: <https://builds.apache.org/job/Jena_Development_Deploy/ws/trunk/jena-fuseki/target/jena-fuseki-1.1.0-SNAPSHOT-distribution.tar.gz>
[INFO] 
[INFO] --- maven-install-plugin:2.5.1:install (default-install) @ jena-fuseki ---
[INFO] Installing <https://builds.apache.org/job/Jena_Development_Deploy/ws/trunk/jena-fuseki/target/jena-fuseki-1.1.0-SNAPSHOT.jar>
to /home/jenkins/jenkins-slave/maven-repositories/1/org/apache/jena/jena-fuseki/1.1.0-SNAPSHOT/jena-fuseki-1.1.0-SNAPSHOT.jar
[INFO] Installing <https://builds.apache.org/job/Jena_Development_Deploy/ws/trunk/jena-fuseki/pom.xml>
to /home/jenkins/jenkins-slave/maven-repositories/1/org/apache/jena/jena-fuseki/1.1.0-SNAPSHOT/jena-fuseki-1.1.0-SNAPSHOT.pom
[INFO] Installing <https://builds.apache.org/job/Jena_Development_Deploy/ws/trunk/jena-fuseki/target/jena-fuseki-1.1.0-SNAPSHOT-sources.jar>
to /home/jenkins/jenkins-slave/maven-repositories/1/org/apache/jena/jena-fuseki/1.1.0-SNAPSHOT/jena-fuseki-1.1.0-SNAPSHOT-sources.jar
[INFO] Installing <https://builds.apache.org/job/Jena_Development_Deploy/ws/trunk/jena-fuseki/target/jena-fuseki-1.1.0-SNAPSHOT-javadoc.jar>
to /home/jenkins/jenkins-slave/maven-repositories/1/org/apache/jena/jena-fuseki/1.1.0-SNAPSHOT/jena-fuseki-1.1.0-SNAPSHOT-javadoc.jar
[INFO] Installing <https://builds.apache.org/job/Jena_Development_Deploy/ws/trunk/jena-fuseki/target/jena-fuseki-1.1.0-SNAPSHOT-tests.jar>
to /home/jenkins/jenkins-slave/maven-repositories/1/org/apache/jena/jena-fuseki/1.1.0-SNAPSHOT/jena-fuseki-1.1.0-SNAPSHOT-tests.jar
[INFO] Installing <https://builds.apache.org/job/Jena_Development_Deploy/ws/trunk/jena-fuseki/target/jena-fuseki-1.1.0-SNAPSHOT-server.jar>
to /home/jenkins/jenkins-slave/maven-repositories/1/org/apache/jena/jena-fuseki/1.1.0-SNAPSHOT/jena-fuseki-1.1.0-SNAPSHOT-server.jar
[INFO] Installing <https://builds.apache.org/job/Jena_Development_Deploy/ws/trunk/jena-fuseki/target/jena-fuseki-1.1.0-SNAPSHOT-distribution.zip>
to /home/jenkins/jenkins-slave/maven-repositories/1/org/apache/jena/jena-fuseki/1.1.0-SNAPSHOT/jena-fuseki-1.1.0-SNAPSHOT-distribution.zip
[INFO] Installing <https://builds.apache.org/job/Jena_Development_Deploy/ws/trunk/jena-fuseki/target/jena-fuseki-1.1.0-SNAPSHOT-distribution.tar.gz>
to /home/jenkins/jenkins-slave/maven-repositories/1/org/apache/jena/jena-fuseki/1.1.0-SNAPSHOT/jena-fuseki-1.1.0-SNAPSHOT-distribution.tar.gz
[INFO] 
[INFO] --- maven-deploy-plugin:2.8.1:deploy (default-deploy) @ jena-fuseki ---
[INFO] Downloading: https://repository.apache.org/content/repositories/snapshots/org/apache/jena/jena-fuseki/1.1.0-SNAPSHOT/maven-metadata.xml
[INFO] Downloaded: https://repository.apache.org/content/repositories/snapshots/org/apache/jena/jena-fuseki/1.1.0-SNAPSHOT/maven-metadata.xml
(3 KB at 1.1 KB/sec)
[INFO] Uploading: https://repository.apache.org/content/repositories/snapshots/org/apache/jena/jena-fuseki/1.1.0-SNAPSHOT/jena-fuseki-1.1.0-20140620.080757-10.jar
[INFO] Uploaded: https://repository.apache.org/content/repositories/snapshots/org/apache/jena/jena-fuseki/1.1.0-SNAPSHOT/jena-fuseki-1.1.0-20140620.080757-10.jar
(181 KB at 201.6 KB/sec)
[INFO] Uploading: https://repository.apache.org/content/repositories/snapshots/org/apache/jena/jena-fuseki/1.1.0-SNAPSHOT/jena-fuseki-1.1.0-20140620.080757-10.pom
[INFO] Uploaded: https://repository.apache.org/content/repositories/snapshots/org/apache/jena/jena-fuseki/1.1.0-SNAPSHOT/jena-fuseki-1.1.0-20140620.080757-10.pom
(13 KB at 25.7 KB/sec)
[INFO] Downloading: https://repository.apache.org/content/repositories/snapshots/org/apache/jena/jena-fuseki/maven-metadata.xml
[INFO] Downloaded: https://repository.apache.org/content/repositories/snapshots/org/apache/jena/jena-fuseki/maven-metadata.xml
(346 B at 0.5 KB/sec)
[INFO] Uploading: https://repository.apache.org/content/repositories/snapshots/org/apache/jena/jena-fuseki/1.1.0-SNAPSHOT/maven-metadata.xml
[INFO] Uploaded: https://repository.apache.org/content/repositories/snapshots/org/apache/jena/jena-fuseki/1.1.0-SNAPSHOT/maven-metadata.xml
(3 KB at 2.3 KB/sec)
[INFO] Uploading: https://repository.apache.org/content/repositories/snapshots/org/apache/jena/jena-fuseki/maven-metadata.xml
[INFO] Uploaded: https://repository.apache.org/content/repositories/snapshots/org/apache/jena/jena-fuseki/maven-metadata.xml
(346 B at 0.3 KB/sec)
[INFO] Uploading: https://repository.apache.org/content/repositories/snapshots/org/apache/jena/jena-fuseki/1.1.0-SNAPSHOT/jena-fuseki-1.1.0-20140620.080757-10-sources.jar
[INFO] Uploaded: https://repository.apache.org/content/repositories/snapshots/org/apache/jena/jena-fuseki/1.1.0-SNAPSHOT/jena-fuseki-1.1.0-20140620.080757-10-sources.jar
(130 KB at 133.4 KB/sec)
[INFO] Uploading: https://repository.apache.org/content/repositories/snapshots/org/apache/jena/jena-fuseki/1.1.0-SNAPSHOT/maven-metadata.xml
[INFO] Uploaded: https://repository.apache.org/content/repositories/snapshots/org/apache/jena/jena-fuseki/1.1.0-SNAPSHOT/maven-metadata.xml
(3 KB at 3.8 KB/sec)
[INFO] Uploading: https://repository.apache.org/content/repositories/snapshots/org/apache/jena/jena-fuseki/1.1.0-SNAPSHOT/jena-fuseki-1.1.0-20140620.080757-10-javadoc.jar
[INFO] Uploaded: https://repository.apache.org/content/repositories/snapshots/org/apache/jena/jena-fuseki/1.1.0-SNAPSHOT/jena-fuseki-1.1.0-20140620.080757-10-javadoc.jar
(387 KB at 171.9 KB/sec)
[INFO] Uploading: https://repository.apache.org/content/repositories/snapshots/org/apache/jena/jena-fuseki/1.1.0-SNAPSHOT/maven-metadata.xml
[INFO] Uploaded: https://repository.apache.org/content/repositories/snapshots/org/apache/jena/jena-fuseki/1.1.0-SNAPSHOT/maven-metadata.xml
(3 KB at 2.9 KB/sec)
[INFO] Uploading: https://repository.apache.org/content/repositories/snapshots/org/apache/jena/jena-fuseki/1.1.0-SNAPSHOT/jena-fuseki-1.1.0-20140620.080757-10-tests.jar
[INFO] Uploaded: https://repository.apache.org/content/repositories/snapshots/org/apache/jena/jena-fuseki/1.1.0-SNAPSHOT/jena-fuseki-1.1.0-20140620.080757-10-tests.jar
(27 KB at 60.7 KB/sec)
[INFO] Uploading: https://repository.apache.org/content/repositories/snapshots/org/apache/jena/jena-fuseki/1.1.0-SNAPSHOT/maven-metadata.xml
[INFO] Uploaded: https://repository.apache.org/content/repositories/snapshots/org/apache/jena/jena-fuseki/1.1.0-SNAPSHOT/maven-metadata.xml
(3 KB at 4.2 KB/sec)
[INFO] Uploading: https://repository.apache.org/content/repositories/snapshots/org/apache/jena/jena-fuseki/1.1.0-SNAPSHOT/jena-fuseki-1.1.0-20140620.080757-10-server.jar
[INFO] Uploaded: https://repository.apache.org/content/repositories/snapshots/org/apache/jena/jena-fuseki/1.1.0-SNAPSHOT/jena-fuseki-1.1.0-20140620.080757-10-server.jar
(18778 KB at 3637.0 KB/sec)
[INFO] Uploading: https://repository.apache.org/content/repositories/snapshots/org/apache/jena/jena-fuseki/1.1.0-SNAPSHOT/maven-metadata.xml
[INFO] Uploaded: https://repository.apache.org/content/repositories/snapshots/org/apache/jena/jena-fuseki/1.1.0-SNAPSHOT/maven-metadata.xml
(3 KB at 5.5 KB/sec)
[INFO] Uploading: https://repository.apache.org/content/repositories/snapshots/org/apache/jena/jena-fuseki/1.1.0-SNAPSHOT/jena-fuseki-1.1.0-20140620.080757-10-distribution.zip
[INFO] Uploaded: https://repository.apache.org/content/repositories/snapshots/org/apache/jena/jena-fuseki/1.1.0-SNAPSHOT/jena-fuseki-1.1.0-20140620.080757-10-distribution.zip
(18864 KB at 5447.1 KB/sec)
[INFO] Uploading: https://repository.apache.org/content/repositories/snapshots/org/apache/jena/jena-fuseki/1.1.0-SNAPSHOT/maven-metadata.xml
[INFO] Uploaded: https://repository.apache.org/content/repositories/snapshots/org/apache/jena/jena-fuseki/1.1.0-SNAPSHOT/maven-metadata.xml
(3 KB at 5.3 KB/sec)
[INFO] Uploading: https://repository.apache.org/content/repositories/snapshots/org/apache/jena/jena-fuseki/1.1.0-SNAPSHOT/jena-fuseki-1.1.0-20140620.080757-10-distribution.tar.gz
[INFO] Uploaded: https://repository.apache.org/content/repositories/snapshots/org/apache/jena/jena-fuseki/1.1.0-SNAPSHOT/jena-fuseki-1.1.0-20140620.080757-10-distribution.tar.gz
(16844 KB at 5524.2 KB/sec)
[INFO] Uploading: https://repository.apache.org/content/repositories/snapshots/org/apache/jena/jena-fuseki/1.1.0-SNAPSHOT/maven-metadata.xml
[INFO] Uploaded: https://repository.apache.org/content/repositories/snapshots/org/apache/jena/jena-fuseki/1.1.0-SNAPSHOT/maven-metadata.xml
(3 KB at 5.5 KB/sec)
[JENKINS] Archiving disabled
[INFO]                                                                         
[INFO] ------------------------------------------------------------------------
[INFO] Building Apache Jena - Security 2.12.0-SNAPSHOT
[INFO] ------------------------------------------------------------------------
[INFO] 
[INFO] --- maven-clean-plugin:2.5:clean (default-clean) @ jena-security ---
[INFO] 
[INFO] --- maven-enforcer-plugin:1.3.1:enforce (enforce) @ jena-security ---
[INFO] 
[INFO] --- maven-enforcer-plugin:1.3.1:enforce (enforce-java) @ jena-security ---
[INFO] 
[INFO] --- maven-remote-resources-plugin:1.5:process (default) @ jena-security ---
[INFO] 
[INFO] --- maven-resources-plugin:2.6:resources (default-resources) @ jena-security ---
[INFO] Using 'UTF-8' encoding to copy filtered resources.
[INFO] skip non existing resourceDirectory <https://builds.apache.org/job/Jena_Development_Deploy/ws/trunk/jena-security/src/main/resources>
[INFO] Copying 3 resources
[INFO] 
[INFO] --- maven-compiler-plugin:3.1:compile (default-compile) @ jena-security ---
[INFO] Changes detected - recompiling the module!
[INFO] Compiling 60 source files to <https://builds.apache.org/job/Jena_Development_Deploy/ws/trunk/jena-security/target/classes>
[WARNING] <https://builds.apache.org/job/Jena_Development_Deploy/ws/trunk/jena-security/src/main/java/org/apache/jena/security/model/impl/SecuredSeqImpl.java>:
Some input files use or override a deprecated API.
[WARNING] <https://builds.apache.org/job/Jena_Development_Deploy/ws/trunk/jena-security/src/main/java/org/apache/jena/security/model/impl/SecuredSeqImpl.java>:
Recompile with -Xlint:deprecation for details.
[WARNING] <https://builds.apache.org/job/Jena_Development_Deploy/ws/trunk/jena-security/src/main/java/org/apache/jena/security/impl/CachedSecurityEvaluator.java>:
<https://builds.apache.org/job/Jena_Development_Deploy/ws/trunk/jena-security/src/main/java/org/apache/jena/security/impl/CachedSecurityEvaluator.java>
uses unchecked or unsafe operations.
[WARNING] <https://builds.apache.org/job/Jena_Development_Deploy/ws/trunk/jena-security/src/main/java/org/apache/jena/security/impl/CachedSecurityEvaluator.java>:
Recompile with -Xlint:unchecked for details.
[INFO] 
[INFO] --- maven-resources-plugin:2.6:testResources (default-testResources) @ jena-security
---
[INFO] Using 'UTF-8' encoding to copy filtered resources.
[INFO] Copying 5 resources
[INFO] Copying 3 resources
[INFO] 
[INFO] --- maven-compiler-plugin:3.1:testCompile (default-testCompile) @ jena-security ---
[INFO] Changes detected - recompiling the module!
[INFO] Compiling 32 source files to <https://builds.apache.org/job/Jena_Development_Deploy/ws/trunk/jena-security/target/test-classes>
[WARNING] <https://builds.apache.org/job/Jena_Development_Deploy/ws/trunk/jena-security/src/test/java/org/apache/jena/security/graph/MemGraphTest.java>:
Some input files use or override a deprecated API.
[WARNING] <https://builds.apache.org/job/Jena_Development_Deploy/ws/trunk/jena-security/src/test/java/org/apache/jena/security/graph/MemGraphTest.java>:
Recompile with -Xlint:deprecation for details.
[WARNING] <https://builds.apache.org/job/Jena_Development_Deploy/ws/trunk/jena-security/src/test/java/org/apache/jena/security/model/SecuredRDFListTest.java>:
<https://builds.apache.org/job/Jena_Development_Deploy/ws/trunk/jena-security/src/test/java/org/apache/jena/security/model/SecuredRDFListTest.java>
uses unchecked or unsafe operations.
[WARNING] <https://builds.apache.org/job/Jena_Development_Deploy/ws/trunk/jena-security/src/test/java/org/apache/jena/security/model/SecuredRDFListTest.java>:
Recompile with -Xlint:unchecked for details.
[INFO] 
[INFO] --- maven-surefire-plugin:2.16:test (default-test) @ jena-security ---
[INFO] Surefire report directory: <https://builds.apache.org/job/Jena_Development_Deploy/ws/trunk/jena-security/target/surefire-reports>

-------------------------------------------------------
 T E S T S
-------------------------------------------------------
Running org.apache.jena.security.model.SecuredPropertyTest
08:08:38 WARN  LiteralLabelImpl          :: inventing a datatype for class com.hp.hpl.jena.rdf.model.impl.ResourceImpl
Tests run: 576, Failures: 0, Errors: 0, Skipped: 0, Time elapsed: 1.54 sec - in org.apache.jena.security.model.SecuredPropertyTest
Running org.apache.jena.security.model.SecuredBagTest
Tests run: 704, Failures: 0, Errors: 0, Skipped: 0, Time elapsed: 0.772 sec - in org.apache.jena.security.model.SecuredBagTest
Running org.apache.jena.security.model.SecuredAltTest
Tests run: 1376, Failures: 0, Errors: 0, Skipped: 0, Time elapsed: 0.975 sec - in org.apache.jena.security.model.SecuredAltTest
Running org.apache.jena.security.model.SecuredResourceTest
Tests run: 544, Failures: 0, Errors: 0, Skipped: 0, Time elapsed: 0.23 sec - in org.apache.jena.security.model.SecuredResourceTest
Running org.apache.jena.security.model.SecuredModelTest
Tests run: 1728, Failures: 0, Errors: 0, Skipped: 0, Time elapsed: 1.102 sec - in org.apache.jena.security.model.SecuredModelTest
Running org.apache.jena.security.model.SecuredReifiedStatementTest
Tests run: 576, Failures: 0, Errors: 0, Skipped: 0, Time elapsed: 0.242 sec - in org.apache.jena.security.model.SecuredReifiedStatementTest
Running org.apache.jena.security.model.SecuredStatementTest
Tests run: 320, Failures: 0, Errors: 0, Skipped: 0, Time elapsed: 0.168 sec - in org.apache.jena.security.model.SecuredStatementTest
Running org.apache.jena.security.model.SecuredRDFListTest
Tests run: 1408, Failures: 0, Errors: 0, Skipped: 0, Time elapsed: 0.782 sec - in org.apache.jena.security.model.SecuredRDFListTest
Running org.apache.jena.security.model.SecuredSeqTest
08:08:43 WARN  LiteralLabelImpl          :: inventing a datatype for class com.hp.hpl.jena.rdf.model.impl.LiteralImpl
Tests run: 1280, Failures: 0, Errors: 0, Skipped: 0, Time elapsed: 0.641 sec - in org.apache.jena.security.model.SecuredSeqTest
Running org.apache.jena.security.model.SecuredRDFNodeTest
Tests run: 128, Failures: 0, Errors: 0, Skipped: 0, Time elapsed: 0.024 sec - in org.apache.jena.security.model.SecuredRDFNodeTest
Running org.apache.jena.security.model.SecuredLiteralTest
Tests run: 704, Failures: 0, Errors: 0, Skipped: 0, Time elapsed: 0.238 sec - in org.apache.jena.security.model.SecuredLiteralTest
Running org.apache.jena.security.model.SecuredModelDetailTest
Tests run: 5, Failures: 0, Errors: 0, Skipped: 0, Time elapsed: 0.014 sec - in org.apache.jena.security.model.SecuredModelDetailTest
Running org.apache.jena.security.graph.MemGraphTest
Tests run: 384, Failures: 0, Errors: 0, Skipped: 0, Time elapsed: 0.112 sec - in org.apache.jena.security.graph.MemGraphTest
Running org.apache.jena.security.graph.SecuredPrefixMappingTest
Tests run: 384, Failures: 0, Errors: 0, Skipped: 0, Time elapsed: 0.088 sec - in org.apache.jena.security.graph.SecuredPrefixMappingTest
Running org.apache.jena.security.graph.GraphEventManagerTest
Tests run: 96, Failures: 0, Errors: 0, Skipped: 0, Time elapsed: 0.038 sec - in org.apache.jena.security.graph.GraphEventManagerTest
Running org.apache.jena.security.graph.BulkUpdateHandlerTest
Tests run: 64, Failures: 0, Errors: 0, Skipped: 0, Time elapsed: 0.029 sec - in org.apache.jena.security.graph.BulkUpdateHandlerTest
Running org.apache.jena.security.graph.TDBGraphTest
Tests run: 384, Failures: 0, Errors: 0, Skipped: 0, Time elapsed: 13.416 sec - in org.apache.jena.security.graph.TDBGraphTest
Running org.apache.jena.security.query.QueryEngineTest
Tests run: 2, Failures: 0, Errors: 0, Skipped: 0, Time elapsed: 0.176 sec - in org.apache.jena.security.query.QueryEngineTest
Running org.apache.jena.security.query.rewriter.OpRewriterTest
Tests run: 2, Failures: 0, Errors: 0, Skipped: 0, Time elapsed: 0 sec - in org.apache.jena.security.query.rewriter.OpRewriterTest
Running org.apache.jena.security.contract.graph.SecuredGraphListenerTest
08:08:58 WARN  riot                      :: [line: 7, col: 43] {W106} Unknown rdf:parseType:
'daml:collection' (treated as 'Literal'.
08:08:58 WARN  riot                      :: [line: 7, col: 43] {W106} Unknown rdf:parseType:
'daml:collection' (treated as 'Literal'.
08:08:58 WARN  riot                      :: [line: 7, col: 43] {W106} Unknown rdf:parseType:
'daml:collection' (treated as 'Literal'.
08:08:58 WARN  riot                      :: [line: 7, col: 43] {W106} Unknown rdf:parseType:
'daml:collection' (treated as 'Literal'.
Tests run: 54, Failures: 0, Errors: 0, Skipped: 0, Time elapsed: 0.244 sec - in org.apache.jena.security.contract.graph.SecuredGraphListenerTest
Running org.apache.jena.security.SecuredAssemblerTest
Tests run: 1, Failures: 0, Errors: 0, Skipped: 0, Time elapsed: 0.222 sec - in org.apache.jena.security.SecuredAssemblerTest

Results :

Tests run: 10720, Failures: 0, Errors: 0, Skipped: 0

[JENKINS] Recording test results
[INFO] 
[INFO] --- maven-jar-plugin:2.4:jar (default-jar) @ jena-security ---
[INFO] Building jar: <https://builds.apache.org/job/Jena_Development_Deploy/ws/trunk/jena-security/target/jena-security-2.12.0-SNAPSHOT.jar>
[INFO] 
[INFO] --- maven-site-plugin:3.3:attach-descriptor (attach-descriptor) @ jena-security ---
[INFO] 
[INFO] --- maven-javadoc-plugin:2.9.1:jar (attach-javadocs) @ jena-security ---
[ERROR] Error fetching link: <https://builds.apache.org/job/Jena_Development_Deploy/ws/trunk/apache-jena-libs/target/apidocs/package-list.>
Ignored it.
[INFO] Building jar: <https://builds.apache.org/job/Jena_Development_Deploy/ws/trunk/jena-security/target/jena-security-2.12.0-SNAPSHOT-javadoc.jar>
[INFO] 
[INFO] --- maven-jar-plugin:2.4:test-jar (default) @ jena-security ---
[INFO] Building jar: <https://builds.apache.org/job/Jena_Development_Deploy/ws/trunk/jena-security/target/jena-security-2.12.0-SNAPSHOT-tests.jar>
[INFO] 
[INFO] --- maven-install-plugin:2.5.1:install (default-install) @ jena-security ---
[INFO] Installing <https://builds.apache.org/job/Jena_Development_Deploy/ws/trunk/jena-security/target/jena-security-2.12.0-SNAPSHOT.jar>
to /home/jenkins/jenkins-slave/maven-repositories/1/org/apache/jena/jena-security/2.12.0-SNAPSHOT/jena-security-2.12.0-SNAPSHOT.jar
[INFO] Installing <https://builds.apache.org/job/Jena_Development_Deploy/ws/trunk/jena-security/pom.xml>
to /home/jenkins/jenkins-slave/maven-repositories/1/org/apache/jena/jena-security/2.12.0-SNAPSHOT/jena-security-2.12.0-SNAPSHOT.pom
[INFO] Installing <https://builds.apache.org/job/Jena_Development_Deploy/ws/trunk/jena-security/target/jena-security-2.12.0-SNAPSHOT-javadoc.jar>
to /home/jenkins/jenkins-slave/maven-repositories/1/org/apache/jena/jena-security/2.12.0-SNAPSHOT/jena-security-2.12.0-SNAPSHOT-javadoc.jar
[INFO] Installing <https://builds.apache.org/job/Jena_Development_Deploy/ws/trunk/jena-security/target/jena-security-2.12.0-SNAPSHOT-tests.jar>
to /home/jenkins/jenkins-slave/maven-repositories/1/org/apache/jena/jena-security/2.12.0-SNAPSHOT/jena-security-2.12.0-SNAPSHOT-tests.jar
[INFO] 
[INFO] --- maven-deploy-plugin:2.8.1:deploy (default-deploy) @ jena-security ---
[INFO] Downloading: https://repository.apache.org/content/repositories/snapshots/org/apache/jena/jena-security/2.12.0-SNAPSHOT/maven-metadata.xml
[INFO] Downloaded: https://repository.apache.org/content/repositories/snapshots/org/apache/jena/jena-security/2.12.0-SNAPSHOT/maven-metadata.xml
(2 KB at 0.6 KB/sec)
[INFO] Uploading: https://repository.apache.org/content/repositories/snapshots/org/apache/jena/jena-security/2.12.0-SNAPSHOT/jena-security-2.12.0-20140620.080915-10.jar
[INFO] Uploaded: https://repository.apache.org/content/repositories/snapshots/org/apache/jena/jena-security/2.12.0-SNAPSHOT/jena-security-2.12.0-20140620.080915-10.jar
(166 KB at 278.7 KB/sec)
[INFO] Uploading: https://repository.apache.org/content/repositories/snapshots/org/apache/jena/jena-security/2.12.0-SNAPSHOT/jena-security-2.12.0-20140620.080915-10.pom
[INFO] Uploaded: https://repository.apache.org/content/repositories/snapshots/org/apache/jena/jena-security/2.12.0-SNAPSHOT/jena-security-2.12.0-20140620.080915-10.pom
(5 KB at 5.6 KB/sec)
[INFO] Downloading: https://repository.apache.org/content/repositories/snapshots/org/apache/jena/jena-security/maven-metadata.xml
[INFO] Downloaded: https://repository.apache.org/content/repositories/snapshots/org/apache/jena/jena-security/maven-metadata.xml
(350 B at 0.3 KB/sec)
[INFO] Uploading: https://repository.apache.org/content/repositories/snapshots/org/apache/jena/jena-security/2.12.0-SNAPSHOT/maven-metadata.xml
[INFO] Uploading: https://repository.apache.org/content/repositories/snapshots/org/apache/jena/jena-security/maven-metadata.xml
[JENKINS] Archiving disabled
[JENKINS] Archiving disabled
[JENKINS] Archiving disabled
[JENKINS] Archiving disabled
[JENKINS] Archiving disabled
[JENKINS] Archiving disabled
[JENKINS] Archiving disabled
[JENKINS] Archiving disabled
[JENKINS] Archiving disabled
[JENKINS] Archiving disabled
[JENKINS] Archiving disabled
[JENKINS] Archiving disabled
[JENKINS] Archiving disabled
[JENKINS] Archiving disabled
[JENKINS] Archiving disabled
[JENKINS] Archiving disabled
[JENKINS] Archiving disabled
[JENKINS] Archiving disabled
[JENKINS] Archiving disabled
[JENKINS] Archiving disabled
[JENKINS] Archiving disabled
[INFO] ------------------------------------------------------------------------
[INFO] Reactor Summary:
[INFO] 
[INFO] Apache Jena - Parent .............................. SUCCESS [47.838s]
[INFO] Apache Jena - IRI ................................. SUCCESS [37.948s]
[INFO] Apache Jena - Core ................................ SUCCESS [1:29.628s]
[INFO] Apache Jena - ARQ (SPARQL 1.1 Query Engine) ....... SUCCESS [1:49.991s]
[INFO] Apache Jena - TDB (Native Triple Store) ........... SUCCESS [1:47.015s]
[INFO] Apache Jena - Libraries POM ....................... SUCCESS [11.915s]
[INFO] Apache Jena - SPARQL Text Search .................. SUCCESS [30.587s]
[INFO] Apache Jena - SPARQL Spatial Search ............... SUCCESS [27.810s]
[INFO] Apache Jena - SDB (SQL based triple store) ........ SUCCESS [1:05.430s]
[INFO] Apache Jena - Fuseki (SPARQL 1.1 Server) .......... SUCCESS [54.233s]
[INFO] Apache Jena - Security ............................ FAILURE [53.399s]
[INFO] Apache Jena - JDBC Parent ......................... SKIPPED
[INFO] Apache Jena - JDBC Core API ....................... SKIPPED
[INFO] Apache Jena - JDBC Remote Endpoint Driver ......... SKIPPED
[INFO] Apache Jena - JDBC In-Memory Driver ............... SKIPPED
[INFO] Apache Jena - JDBC TDB Driver ..................... SKIPPED
[INFO] Apache Jena - JDBC Driver Bundle .................. SKIPPED
[INFO] Apache Jena - Maven Plugins, including schemagen .. SKIPPED
[INFO] Apache Jena - Distribution ........................ SKIPPED
[INFO] Apache Jena ....................................... SKIPPED
[INFO] ------------------------------------------------------------------------
[INFO] BUILD FAILURE
[INFO] ------------------------------------------------------------------------
[INFO] Total time: 11:25.129s
[INFO] Finished at: Fri Jun 20 08:09:43 UTC 2014
[INFO] Final Memory: 72M/402M
[INFO] ------------------------------------------------------------------------
Waiting for Jenkins to finish collecting data
[ERROR] Failed to execute goal org.apache.maven.plugins:maven-deploy-plugin:2.8.1:deploy (default-deploy)
on project jena-security: Failed to deploy metadata: Could not transfer metadata org.apache.jena:jena-security:2.12.0-SNAPSHOT/maven-metadata.xml
from/to apache.snapshots.https (https://repository.apache.org/content/repositories/snapshots):
The target server failed to respond -> [Help 1]
[ERROR] 
[ERROR] To see the full stack trace of the errors, re-run Maven with the -e switch.
[ERROR] Re-run Maven using the -X switch to enable full debug logging.
[ERROR] 
[ERROR] For more information about the errors and possible solutions, please read the following
articles:
[ERROR] [Help 1] http://cwiki.apache.org/confluence/display/MAVEN/MojoExecutionException
[ERROR] 
[ERROR] After correcting the problems, you can resume the build with the command
[ERROR]   mvn <goals> -rf :jena-security
Sending e-mails to: commits@jena.apache.org
channel stopped

Mime
View raw message