jena-commits mailing list archives

Site index · List index
Message view « Date » · « Thread »
Top « Date » · « Thread »
From Apache Jenkins Server <jenk...@builds.apache.org>
Subject Build failed in Jenkins: Jena_Development_Test #1262
Date Mon, 09 Jun 2014 12:47:22 GMT
See <https://builds.apache.org/job/Jena_Development_Test/1262/changes>

Changes:

[rvesse] Require Java 7 for Jena 2.12.0 onwards (JENA-694)
Includes some whitespace clean up to the relevant POMs

------------------------------------------
Started by an SCM change
Building remotely on ubuntu5 (Ubuntu ubuntu) in workspace <https://builds.apache.org/job/Jena_Development_Test/ws/>
Cleaning up <https://builds.apache.org/job/Jena_Development_Test/ws/trunk>
Deleting <https://builds.apache.org/job/Jena_Development_Test/ws/trunk/target>
Deleting <https://builds.apache.org/job/Jena_Development_Test/ws/trunk/jena-arq/target>
Deleting <https://builds.apache.org/job/Jena_Development_Test/ws/trunk/jena-iri/target>
Deleting <https://builds.apache.org/job/Jena_Development_Test/ws/trunk/jena-spatial/target>
Deleting <https://builds.apache.org/job/Jena_Development_Test/ws/trunk/jena-parent/target>
Deleting <https://builds.apache.org/job/Jena_Development_Test/ws/trunk/jena-text/DB>
Deleting <https://builds.apache.org/job/Jena_Development_Test/ws/trunk/jena-text/target>
Deleting <https://builds.apache.org/job/Jena_Development_Test/ws/trunk/apache-jena/target>
Deleting <https://builds.apache.org/job/Jena_Development_Test/ws/trunk/apache-jena-libs/target>
Deleting <https://builds.apache.org/job/Jena_Development_Test/ws/trunk/jena-sdb/target>
Deleting <https://builds.apache.org/job/Jena_Development_Test/ws/trunk/jena-tdb/target>
Deleting <https://builds.apache.org/job/Jena_Development_Test/ws/trunk/jena-jdbc/target>
Deleting <https://builds.apache.org/job/Jena_Development_Test/ws/trunk/jena-jdbc/jena-jdbc-driver-tdb/target>
Deleting <https://builds.apache.org/job/Jena_Development_Test/ws/trunk/jena-jdbc/jena-jdbc-core/target>
Deleting <https://builds.apache.org/job/Jena_Development_Test/ws/trunk/jena-jdbc/jena-jdbc-driver-mem/target>
Deleting <https://builds.apache.org/job/Jena_Development_Test/ws/trunk/jena-jdbc/jena-jdbc-driver-bundle/target>
Deleting <https://builds.apache.org/job/Jena_Development_Test/ws/trunk/jena-jdbc/jena-jdbc-driver-remote/target>
Deleting <https://builds.apache.org/job/Jena_Development_Test/ws/trunk/jena-maven-tools/target>
Deleting <https://builds.apache.org/job/Jena_Development_Test/ws/trunk/jena-core/target>
Deleting <https://builds.apache.org/job/Jena_Development_Test/ws/trunk/jena-fuseki/target>
Deleting <https://builds.apache.org/job/Jena_Development_Test/ws/trunk/jena-security/target>
Updating http://svn.apache.org/repos/asf/jena/trunk at revision '2014-06-09T12:45:18.760 +0000'
U         pom.xml
U         jena-arq/ResultSets/xml-to-html-links.xsl
U         jena-fuseki/pages/xml-to-html-links.xsl
U         jena-parent/pom.xml
At revision 1601358
Parsing POMs
maven31-agent.jar already up to date
maven31-interceptor.jar already up to date
maven3-interceptor-commons.jar already up to date
[trunk] $ /home/hudson/tools/java/latest1.6/bin/java -Xrs -cp /home/jenkins/jenkins-slave/maven31-agent.jar:/home/jenkins/jenkins-slave/tools/hudson.tasks.Maven_MavenInstallation/maven-3.1.1/boot/plexus-classworlds-2.5.1.jar:/home/jenkins/jenkins-slave/tools/hudson.tasks.Maven_MavenInstallation/maven-3.1.1/conf/logging
jenkins.maven3.agent.Maven31Main /home/jenkins/jenkins-slave/tools/hudson.tasks.Maven_MavenInstallation/maven-3.1.1
/home/jenkins/jenkins-slave/slave.jar /home/jenkins/jenkins-slave/maven31-interceptor.jar
/home/jenkins/jenkins-slave/maven3-interceptor-commons.jar 48202
<===[JENKINS REMOTING CAPACITY]===>   channel started
log4j:WARN No appenders could be found for logger (org.apache.commons.beanutils.converters.BooleanConverter).
log4j:WARN Please initialize the log4j system properly.
Executing Maven:  -B -f <https://builds.apache.org/job/Jena_Development_Test/ws/trunk/pom.xml>
-Dmaven.repo.local=/home/jenkins/jenkins-slave/maven-repositories/0 clean test
[INFO] Scanning for projects...
[INFO] ------------------------------------------------------------------------
[INFO] Reactor Build Order:
[INFO] 
[INFO] Apache Jena - Parent
[INFO] Apache Jena - IRI
[INFO] Apache Jena - Core
[INFO] Apache Jena - ARQ (SPARQL 1.1 Query Engine)
[INFO] Apache Jena - TDB (Native Triple Store)
[INFO] Apache Jena - Libraries POM
[INFO] Apache Jena - SPARQL Text Search
[INFO] Apache Jena - SPARQL Spatial Search
[INFO] Apache Jena - SDB (SQL based triple store)
[INFO] Apache Jena - Fuseki (SPARQL 1.1 Server)
[INFO] Apache Jena - Security
[INFO] Apache Jena - JDBC Parent
[INFO] Apache Jena - JDBC Core API
[INFO] Apache Jena - JDBC Remote Endpoint Driver
[INFO] Apache Jena - JDBC In-Memory Driver
[INFO] Apache Jena - JDBC TDB Driver
[INFO] Apache Jena - JDBC Driver Bundle
[INFO] Apache Jena - Maven Plugins, including schemagen
[INFO] Apache Jena - Distribution
[INFO] Apache Jena
[INFO]                                                                         
[INFO] ------------------------------------------------------------------------
[INFO] Building Apache Jena - Parent 10-SNAPSHOT
[INFO] ------------------------------------------------------------------------
[INFO] 
[INFO] --- maven-clean-plugin:2.5:clean (default-clean) @ jena-parent ---
[INFO] 
[INFO] --- maven-enforcer-plugin:1.2:enforce (enforce) @ jena-parent ---
[INFO] 
[INFO] --- maven-enforcer-plugin:1.2:enforce (enforce-java) @ jena-parent ---
[WARNING] Rule 0: org.apache.maven.plugins.enforcer.RequireJavaVersion failed with message:
Detected JDK Version: 1.6.0-45 is not in the allowed range 1.7.0.
[JENKINS] Archiving disabled
[JENKINS] Archiving disabled
[JENKINS] Archiving disabled
[JENKINS] Archiving disabled
[JENKINS] Archiving disabled
[JENKINS] Archiving disabled
[JENKINS] Archiving disabled
[JENKINS] Archiving disabled
[JENKINS] Archiving disabled
[JENKINS] Archiving disabled
[JENKINS] Archiving disabled
[JENKINS] Archiving disabled
[JENKINS] Archiving disabled
[JENKINS] Archiving disabled
[JENKINS] Archiving disabled
[JENKINS] Archiving disabled
[JENKINS] Archiving disabled
[JENKINS] Archiving disabled
[JENKINS] Archiving disabled
[JENKINS] Archiving disabled
[JENKINS] Archiving disabled[INFO] ------------------------------------------------------------------------
[INFO] Reactor Summary:
[INFO] 
[INFO] Apache Jena - Parent .............................. FAILURE [27.666s]
[INFO] Apache Jena - IRI ................................. SKIPPED
[INFO] Apache Jena - Core ................................ SKIPPED
[INFO] Apache Jena - ARQ (SPARQL 1.1 Query Engine) ....... SKIPPED
[INFO] Apache Jena - TDB (Native Triple Store) ........... SKIPPED
[INFO] Apache Jena - Libraries POM ....................... SKIPPED
[INFO] Apache Jena - SPARQL Text Search .................. SKIPPED
[INFO] Apache Jena - SPARQL Spatial Search ............... SKIPPED
[INFO] Apache Jena - SDB (SQL based triple store) ........ SKIPPED
[INFO] Apache Jena - Fuseki (SPARQL 1.1 Server) .......... SKIPPED
[INFO] Apache Jena - Security ............................ SKIPPED
[INFO] Apache Jena - JDBC Parent ......................... SKIPPED
[INFO] Apache Jena - JDBC Core API ....................... SKIPPED
[INFO] Apache Jena - JDBC Remote Endpoint Driver ......... SKIPPED
[INFO] Apache Jena - JDBC In-Memory Driver ............... SKIPPED
[INFO] Apache Jena - JDBC TDB Driver ..................... SKIPPED
[INFO] Apache Jena - JDBC Driver Bundle .................. SKIPPED
[INFO] Apache Jena - Maven Plugins, including schemagen .. SKIPPED
[INFO] Apache Jena - Distribution ........................ SKIPPED
[INFO] Apache Jena ....................................... SKIPPED
[INFO] ------------------------------------------------------------------------
[INFO] BUILD FAILURE
[INFO] ------------------------------------------------------------------------
[INFO] Total time: 41.953s
[INFO] Finished at: Mon Jun 09 12:47:04 UTC 2014

[INFO] Final Memory: 10M/60M
[INFO] ------------------------------------------------------------------------
Waiting for Jenkins to finish collecting data
[ERROR] Failed to execute goal org.apache.maven.plugins:maven-enforcer-plugin:1.2:enforce
(enforce-java) on project jena-parent: Some Enforcer rules have failed. Look above for specific
messages explaining why the rule failed. -> [Help 1]
[ERROR] 
[ERROR] To see the full stack trace of the errors, re-run Maven with the -e switch.
[ERROR] Re-run Maven using the -X switch to enable full debug logging.
[ERROR] 
[ERROR] For more information about the errors and possible solutions, please read the following
articles:
[ERROR] [Help 1] http://cwiki.apache.org/confluence/display/MAVEN/MojoExecutionException
Sending e-mails to: commits@jena.apache.org
channel stopped

Mime
View raw message