jena-commits mailing list archives

Site index · List index
Message view « Date » · « Thread »
Top « Date » · « Thread »
From Apache Jenkins Server <jenk...@builds.apache.org>
Subject Build failed in Jenkins: Jena_Development_Test #1256
Date Fri, 30 May 2014 20:30:34 GMT
See <https://builds.apache.org/job/Jena_Development_Test/1256/changes>

Changes:

[andy] ARQ change

[andy] Remove unused in pom

------------------------------------------
[...truncated 12141 lines...]
Tests run: 1, Failures: 0, Errors: 0, Skipped: 0, Time elapsed: 0.002 sec - in com.hp.hpl.jena.tdb.sys.TS_Sys
Running com.hp.hpl.jena.tdb.solver.TS_SolverTDB
Tests run: 10, Failures: 0, Errors: 0, Skipped: 0, Time elapsed: 0.161 sec - in com.hp.hpl.jena.tdb.solver.TS_SolverTDB
Running com.hp.hpl.jena.tdb.transaction.TS_TransactionTDB
Tests run: 129, Failures: 0, Errors: 0, Skipped: 0, Time elapsed: 121.234 sec - in com.hp.hpl.jena.tdb.transaction.TS_TransactionTDB
Running com.hp.hpl.jena.tdb.assembler.TS_TDBAssembler
Tests run: 7, Failures: 0, Errors: 0, Skipped: 0, Time elapsed: 2.367 sec - in com.hp.hpl.jena.tdb.assembler.TS_TDBAssembler
Running com.hp.hpl.jena.tdb.nodetable.TS_NodeTable
Tests run: 46, Failures: 0, Errors: 0, Skipped: 0, Time elapsed: 0.027 sec - in com.hp.hpl.jena.tdb.nodetable.TS_NodeTable
Running com.hp.hpl.jena.tdb.base.recordfile.TS_RecordFile
Tests run: 2, Failures: 0, Errors: 0, Skipped: 0, Time elapsed: 0.002 sec - in com.hp.hpl.jena.tdb.base.recordfile.TS_RecordFile
Running com.hp.hpl.jena.tdb.base.objectfile.TS_ObjectFile
Tests run: 40, Failures: 0, Errors: 0, Skipped: 0, Time elapsed: 0.17 sec - in com.hp.hpl.jena.tdb.base.objectfile.TS_ObjectFile
Running com.hp.hpl.jena.tdb.base.block.TS_Block
Tests run: 18, Failures: 0, Errors: 0, Skipped: 0, Time elapsed: 0.425 sec - in com.hp.hpl.jena.tdb.base.block.TS_Block
Running com.hp.hpl.jena.tdb.base.file.TS_File
Tests run: 39, Failures: 0, Errors: 0, Skipped: 0, Time elapsed: 0.412 sec - in com.hp.hpl.jena.tdb.base.file.TS_File
Running com.hp.hpl.jena.tdb.base.record.TS_Record
Tests run: 54, Failures: 0, Errors: 0, Skipped: 0, Time elapsed: 0.02 sec - in com.hp.hpl.jena.tdb.base.record.TS_Record
Running com.hp.hpl.jena.tdb.lib.TS_LibTDB
Tests run: 9, Failures: 0, Errors: 0, Skipped: 0, Time elapsed: 0.004 sec - in com.hp.hpl.jena.tdb.lib.TS_LibTDB
Running com.hp.hpl.jena.tdb.graph.TS_Graph
Tests run: 89, Failures: 0, Errors: 0, Skipped: 4, Time elapsed: 1.824 sec - in com.hp.hpl.jena.tdb.graph.TS_Graph
Running com.hp.hpl.jena.tdb.store.TS_Store
Tests run: 199, Failures: 0, Errors: 0, Skipped: 0, Time elapsed: 32.92 sec - in com.hp.hpl.jena.tdb.store.TS_Store

Results :

Tests run: 763, Failures: 0, Errors: 0, Skipped: 4

[JENKINS] Recording test results
[JENKINS] Archiving disabled
[INFO]                                                                         
[INFO] ------------------------------------------------------------------------
[INFO] Building Apache Jena - Libraries POM 2.11.2-SNAPSHOT
[INFO] ------------------------------------------------------------------------
[INFO] 
[INFO] --- maven-clean-plugin:2.5:clean (default-clean) @ apache-jena-libs ---
[INFO] 
[INFO] --- maven-enforcer-plugin:1.2:enforce (enforce) @ apache-jena-libs ---
[INFO] 
[INFO] --- maven-remote-resources-plugin:1.5:process (default) @ apache-jena-libs ---
[JENKINS] Archiving disabled
[INFO]                                                                         
[INFO] ------------------------------------------------------------------------
[INFO] Building Apache Jena - SPARQL Text Search 1.0.2-SNAPSHOT
[INFO] ------------------------------------------------------------------------
[INFO] 
[INFO] --- maven-clean-plugin:2.5:clean (default-clean) @ jena-text ---
[INFO] 
[INFO] --- maven-enforcer-plugin:1.2:enforce (enforce) @ jena-text ---
[INFO] 
[INFO] --- maven-remote-resources-plugin:1.5:process (default) @ jena-text ---
[INFO] 
[INFO] --- maven-resources-plugin:2.6:resources (default-resources) @ jena-text ---
[INFO] Using 'UTF-8' encoding to copy filtered resources.
[INFO] Copying 1 resource
[INFO] Copying 2 resources
[INFO] Copying 3 resources
[INFO] 
[INFO] --- maven-compiler-plugin:3.1:compile (default-compile) @ jena-text ---
[INFO] Changes detected - recompiling the module!
[INFO] Compiling 27 source files to <https://builds.apache.org/job/Jena_Development_Test/ws/trunk/jena-text/target/classes>
[INFO] 
[INFO] --- maven-resources-plugin:2.6:testResources (default-testResources) @ jena-text ---
[INFO] Using 'UTF-8' encoding to copy filtered resources.
[INFO] Copying 1 resource
[INFO] Copying 3 resources
[INFO] 
[INFO] --- maven-compiler-plugin:3.1:testCompile (default-testCompile) @ jena-text ---
[INFO] Changes detected - recompiling the module!
[INFO] Compiling 21 source files to <https://builds.apache.org/job/Jena_Development_Test/ws/trunk/jena-text/target/test-classes>
[INFO] 
[INFO] --- maven-surefire-plugin:2.15:test (default-test) @ jena-text ---
[INFO] Surefire report directory: <https://builds.apache.org/job/Jena_Development_Test/ws/trunk/jena-text/target/surefire-reports>

-------------------------------------------------------
 T E S T S
-------------------------------------------------------
Running org.apache.jena.query.text.TS_Text
Tests run: 89, Failures: 0, Errors: 0, Skipped: 0, Time elapsed: 10.143 sec - in org.apache.jena.query.text.TS_Text

Results :

Tests run: 89, Failures: 0, Errors: 0, Skipped: 0

[JENKINS] Recording test results
[JENKINS] Archiving disabled
[INFO]                                                                         
[INFO] ------------------------------------------------------------------------
[INFO] Building Apache Jena - SPARQL Spatial Search 1.0.2-SNAPSHOT
[INFO] ------------------------------------------------------------------------
[INFO] 
[INFO] --- maven-clean-plugin:2.5:clean (default-clean) @ jena-spatial ---
[INFO] 
[INFO] --- maven-enforcer-plugin:1.2:enforce (enforce) @ jena-spatial ---
[INFO] 
[INFO] --- maven-remote-resources-plugin:1.5:process (default) @ jena-spatial ---
[INFO] 
[INFO] --- maven-resources-plugin:2.6:resources (default-resources) @ jena-spatial ---
[INFO] Using 'UTF-8' encoding to copy filtered resources.
[INFO] Copying 1 resource
[INFO] Copying 0 resource
[INFO] Copying 3 resources
[INFO] 
[INFO] --- maven-compiler-plugin:3.1:compile (default-compile) @ jena-spatial ---
[INFO] Changes detected - recompiling the module!
[INFO] Compiling 37 source files to <https://builds.apache.org/job/Jena_Development_Test/ws/trunk/jena-spatial/target/classes>
[INFO] 
[INFO] --- maven-resources-plugin:2.6:testResources (default-testResources) @ jena-spatial
---
[INFO] Using 'UTF-8' encoding to copy filtered resources.
[INFO] Copying 9 resources
[INFO] Copying 3 resources
[INFO] 
[INFO] --- maven-compiler-plugin:3.1:testCompile (default-testCompile) @ jena-spatial ---
[INFO] Changes detected - recompiling the module!
[INFO] Compiling 37 source files to <https://builds.apache.org/job/Jena_Development_Test/ws/trunk/jena-spatial/target/test-classes>
[INFO] 
[INFO] --- maven-surefire-plugin:2.15:test (default-test) @ jena-spatial ---
[INFO] Surefire report directory: <https://builds.apache.org/job/Jena_Development_Test/ws/trunk/jena-spatial/target/surefire-reports>

-------------------------------------------------------
 T E S T S
-------------------------------------------------------
Running org.apache.jena.query.spatial.TS_Spatial
Tests run: 53, Failures: 0, Errors: 0, Skipped: 0, Time elapsed: 21.318 sec - in org.apache.jena.query.spatial.TS_Spatial

Results :

Tests run: 53, Failures: 0, Errors: 0, Skipped: 0

[JENKINS] Recording test results
[JENKINS] Archiving disabled
[INFO]                                                                         
[INFO] ------------------------------------------------------------------------
[INFO] Building Apache Jena - SDB (SQL based triple store) 1.4.2-SNAPSHOT
[INFO] ------------------------------------------------------------------------
[INFO] 
[INFO] --- maven-clean-plugin:2.5:clean (default-clean) @ jena-sdb ---
[INFO] 
[INFO] --- maven-enforcer-plugin:1.2:enforce (enforce) @ jena-sdb ---
[INFO] 
[INFO] --- maven-remote-resources-plugin:1.5:process (default) @ jena-sdb ---
[INFO] 
[INFO] --- maven-resources-plugin:2.6:resources (default-resources) @ jena-sdb ---
[INFO] Using 'UTF-8' encoding to copy filtered resources.
[INFO] Copying 1 resource to com/hp/hpl/jena/sdb/
[INFO] Copying 3 resources
[INFO] 
[INFO] --- maven-compiler-plugin:3.1:compile (default-compile) @ jena-sdb ---
[INFO] Changes detected - recompiling the module!
[INFO] Compiling 348 source files to <https://builds.apache.org/job/Jena_Development_Test/ws/trunk/jena-sdb/target/classes>
[INFO] 
[INFO] --- maven-resources-plugin:2.6:testResources (default-testResources) @ jena-sdb ---
[INFO] Using 'UTF-8' encoding to copy filtered resources.
[INFO] skip non existing resourceDirectory <https://builds.apache.org/job/Jena_Development_Test/ws/trunk/jena-sdb/src/test/resources>
[INFO] Copying 3 resources
[INFO] 
[INFO] --- maven-compiler-plugin:3.1:testCompile (default-testCompile) @ jena-sdb ---
[INFO] Changes detected - recompiling the module!
[INFO] Compiling 68 source files to <https://builds.apache.org/job/Jena_Development_Test/ws/trunk/jena-sdb/target/test-classes>
[INFO] -------------------------------------------------------------
[ERROR] COMPILATION ERROR : 
[INFO] -------------------------------------------------------------
[ERROR] <https://builds.apache.org/job/Jena_Development_Test/ws/trunk/jena-sdb/src/test/java/com/hp/hpl/jena/sdb/test/junit/QueryTestSDB.java>:[169,51]
cannot find symbol
symbol  : variable strictGraph
location: class com.hp.hpl.jena.query.ARQ
[ERROR] <https://builds.apache.org/job/Jena_Development_Test/ws/trunk/jena-sdb/src/test/java/com/hp/hpl/jena/sdb/test/junit/QueryTestSDB.java>:[170,24]
cannot find symbol
symbol  : variable strictGraph
location: class com.hp.hpl.jena.query.ARQ
[ERROR] <https://builds.apache.org/job/Jena_Development_Test/ws/trunk/jena-sdb/src/test/java/com/hp/hpl/jena/sdb/test/junit/QueryTestSDB.java>:[172,33]
cannot find symbol
symbol  : variable strictGraph
location: class com.hp.hpl.jena.query.ARQ
[INFO] 3 errors 
[INFO] -------------------------------------------------------------
[JENKINS] Archiving disabled
[JENKINS] Archiving disabled
[JENKINS] Archiving disabled
[JENKINS] Archiving disabled
[JENKINS] Archiving disabled
[JENKINS] Archiving disabled
[JENKINS] Archiving disabled
[JENKINS] Archiving disabled
[JENKINS] Archiving disabled
[JENKINS] Archiving disabled
[JENKINS] Archiving disabled
[JENKINS] Archiving disabled
[JENKINS] Archiving disabled
[JENKINS] Archiving disabled
[JENKINS] Archiving disabled
[JENKINS] Archiving disabled
[JENKINS] Archiving disabled
[JENKINS] Archiving disabled
[JENKINS] Archiving disabled
[JENKINS] Archiving disabled
[JENKINS] Archiving disabled[INFO] ------------------------------------------------------------------------
[INFO] Reactor Summary:
[INFO] 
[INFO] Apache Jena - Parent .............................. SUCCESS [34.504s]
[INFO] Apache Jena - IRI ................................. SUCCESS [21.941s]
[INFO] Apache Jena - Core ................................ SUCCESS [1:05.994s]
[INFO] Apache Jena - ARQ (SPARQL 1.1 Query Engine) ....... SUCCESS [1:05.522s]
[INFO] Apache Jena - TDB (Native Triple Store) ........... SUCCESS [2:52.473s]
[INFO] Apache Jena - Libraries POM ....................... SUCCESS [2.919s]
[INFO] Apache Jena - SPARQL Text Search .................. SUCCESS [17.676s]
[INFO] Apache Jena - SPARQL Spatial Search ............... SUCCESS [28.976s]
[INFO] Apache Jena - SDB (SQL based triple store) ........ FAILURE [6.069s]
[INFO] Apache Jena - Fuseki (SPARQL 1.1 Server) .......... SKIPPED
[INFO] Apache Jena - Security ............................ SKIPPED
[INFO] Apache Jena - JDBC Parent ......................... SKIPPED
[INFO] Apache Jena - JDBC Core API ....................... SKIPPED
[INFO] Apache Jena - JDBC Remote Endpoint Driver ......... SKIPPED
[INFO] Apache Jena - JDBC In-Memory Driver ............... SKIPPED
[INFO] Apache Jena - JDBC TDB Driver ..................... SKIPPED
[INFO] Apache Jena - JDBC Driver Bundle .................. SKIPPED
[INFO] Apache Jena - Maven Plugins, including schemagen .. SKIPPED
[INFO] Apache Jena - Distribution ........................ SKIPPED
[INFO] Apache Jena ....................................... SKIPPED
[INFO] ------------------------------------------------------------------------
[INFO] BUILD FAILURE
[INFO] ------------------------------------------------------------------------
[INFO] Total time: 7:24.876s
[INFO] Finished at: Fri May 30 20:30:04 UTC 2014

[INFO] Final Memory: 36M/164M
[INFO] ------------------------------------------------------------------------
[ERROR] Failed to execute goal org.apache.maven.plugins:maven-compiler-plugin:3.1:testCompile
(default-testCompile) on project jena-sdb: Compilation failure: Compilation failure:
[ERROR] <https://builds.apache.org/job/Jena_Development_Test/ws/trunk/jena-sdb/src/test/java/com/hp/hpl/jena/sdb/test/junit/QueryTestSDB.java>:[169,51]
cannot find symbol
[ERROR] symbol  : variable strictGraph
[ERROR] location: class com.hp.hpl.jena.query.ARQ
[ERROR] <https://builds.apache.org/job/Jena_Development_Test/ws/trunk/jena-sdb/src/test/java/com/hp/hpl/jena/sdb/test/junit/QueryTestSDB.java>:[170,24]
cannot find symbol
[ERROR] symbol  : variable strictGraph
[ERROR] location: class com.hp.hpl.jena.query.ARQ
[ERROR] <https://builds.apache.org/job/Jena_Development_Test/ws/trunk/jena-sdb/src/test/java/com/hp/hpl/jena/sdb/test/junit/QueryTestSDB.java>:[172,33]
cannot find symbol
[ERROR] symbol  : variable strictGraph
[ERROR] location: class com.hp.hpl.jena.query.ARQ
[ERROR] -> [Help 1]
[ERROR] 
[ERROR] To see the full stack trace of the errors, re-run Maven with the -e switch.
[ERROR] Re-run Maven using the -X switch to enable full debug logging.
[ERROR] 
[ERROR] For more information about the errors and possible solutions, please read the following
articles:
[ERROR] [Help 1] http://cwiki.apache.org/confluence/display/MAVEN/MojoFailureException
[ERROR] 
[ERROR] After correcting the problems, you can resume the build with the command
[ERROR]   mvn <goals> -rf :jena-sdb
Sending e-mails to: commits@jena.apache.org
Sending e-mails to: commits@jena.apache.org
channel stopped

Mime
View raw message