jena-commits mailing list archives

Site index · List index
Message view « Date » · « Thread »
Top « Date » · « Thread »
From Apache Jenkins Server <jenk...@builds.apache.org>
Subject Build failed in Jenkins: Jena_Development_Deploy #592
Date Thu, 10 Apr 2014 09:42:14 GMT
See <https://builds.apache.org/job/Jena_Development_Deploy/592/changes>

Changes:

[rvesse] Further test from Andy around non-foldable expressions (JENA-630)

[rvesse] Improve ExprTransformConstantFold to not unecessarily call copySubstitute on non-foldable
expressions (JENA-630)

[claude] Fixed function override changes required by change to  eval(java.util.List<com.hp.hpl.jena.sparql.expr.NodeValue>)
in com.hp.hpl.jena.sparql.expr.ExprFunctionN

[andy] Make ExprFunctionN.eval(List<NodeValue) public.

Note for some functions which are special forms, this is a meaningless operation.

[rvesse] Additional tests for JENA-630 based on Andy's examples

[rvesse] Rework ExprTransformConstantFold to propogate folded expressions up the tree (JENA-630)

[rvesse] Try to avoid unecessary copies of expressions during constant folding (JENA-630)

------------------------------------------
[...truncated 13279 lines...]
 T E S T S
-------------------------------------------------------
Running org.apache.jena.fuseki.TS_Fuseki
Tests run: 82, Failures: 0, Errors: 0, Skipped: 0, Time elapsed: 3.542 sec

Results :

Tests run: 82, Failures: 0, Errors: 0, Skipped: 0

[JENKINS] Recording test results
[INFO] 
[INFO] --- maven-jar-plugin:2.4:jar (default-jar) @ jena-fuseki ---
[INFO] Building jar: <https://builds.apache.org/job/Jena_Development_Deploy/ws/trunk/jena-fuseki/target/jena-fuseki-1.0.2-SNAPSHOT.jar>
[INFO] 
[INFO] --- maven-site-plugin:3.2:attach-descriptor (attach-descriptor) @ jena-fuseki ---
[INFO] 
[INFO] --- maven-source-plugin:2.1.2:jar-no-fork (attach-sources) @ jena-fuseki ---
[INFO] META-INF already added, skipping
[INFO] org already added, skipping
[INFO] org/apache already added, skipping
[INFO] org/apache/jena already added, skipping
[INFO] org/apache/jena/fuseki already added, skipping
[INFO] META-INF already added, skipping
[INFO] META-INF/NOTICE already added, skipping
[INFO] META-INF/LICENSE already added, skipping
[INFO] META-INF/DEPENDENCIES already added, skipping
[INFO] Building jar: <https://builds.apache.org/job/Jena_Development_Deploy/ws/trunk/jena-fuseki/target/jena-fuseki-1.0.2-SNAPSHOT-sources.jar>
[INFO] META-INF already added, skipping
[INFO] org already added, skipping
[INFO] org/apache already added, skipping
[INFO] org/apache/jena already added, skipping
[INFO] org/apache/jena/fuseki already added, skipping
[INFO] META-INF already added, skipping
[INFO] META-INF/NOTICE already added, skipping
[INFO] META-INF/LICENSE already added, skipping
[INFO] META-INF/DEPENDENCIES already added, skipping
[INFO] 
[INFO] --- maven-javadoc-plugin:2.9.1:jar (attach-javadocs) @ jena-fuseki ---
[INFO] Building jar: <https://builds.apache.org/job/Jena_Development_Deploy/ws/trunk/jena-fuseki/target/jena-fuseki-1.0.2-SNAPSHOT-javadoc.jar>
[INFO] 
[INFO] --- maven-jar-plugin:2.4:test-jar (default) @ jena-fuseki ---
[INFO] Building jar: <https://builds.apache.org/job/Jena_Development_Deploy/ws/trunk/jena-fuseki/target/jena-fuseki-1.0.2-SNAPSHOT-tests.jar>
[INFO] 
[INFO] --- maven-shade-plugin:2.1:shade (default) @ jena-fuseki ---
[INFO] Including org.apache.jena:jena-arq:jar:2.11.2-SNAPSHOT in the shaded jar.
[INFO] Including com.github.jsonld-java:jsonld-java:jar:0.3 in the shaded jar.
[INFO] Including com.fasterxml.jackson.core:jackson-core:jar:2.3.1 in the shaded jar.
[INFO] Including com.fasterxml.jackson.core:jackson-databind:jar:2.3.1 in the shaded jar.
[INFO] Including com.fasterxml.jackson.core:jackson-annotations:jar:2.3.0 in the shaded jar.
[INFO] Including org.apache.httpcomponents:httpclient-cache:jar:4.2.6 in the shaded jar.
[INFO] Including org.apache.jena:jena-core:jar:2.11.2-SNAPSHOT in the shaded jar.
[INFO] Including org.apache.jena:jena-iri:jar:1.0.2-SNAPSHOT in the shaded jar.
[INFO] Including xerces:xercesImpl:jar:2.11.0 in the shaded jar.
[INFO] Including xml-apis:xml-apis:jar:1.4.01 in the shaded jar.
[INFO] Including org.apache.jena:jena-tdb:jar:1.0.2-SNAPSHOT in the shaded jar.
[INFO] Including org.apache.jena:jena-text:jar:1.0.2-SNAPSHOT in the shaded jar.
[INFO] Skipping pom dependency org.apache.jena:apache-jena-libs:pom:2.11.2-SNAPSHOT in the
shaded jar.
[INFO] Including org.apache.lucene:lucene-core:jar:4.6.1 in the shaded jar.
[INFO] Including org.apache.lucene:lucene-analyzers-common:jar:4.6.1 in the shaded jar.
[INFO] Including org.apache.lucene:lucene-queryparser:jar:4.6.1 in the shaded jar.
[INFO] Including org.apache.lucene:lucene-queries:jar:4.6.1 in the shaded jar.
[INFO] Including org.apache.lucene:lucene-sandbox:jar:4.6.1 in the shaded jar.
[INFO] Including jakarta-regexp:jakarta-regexp:jar:1.4 in the shaded jar.
[INFO] Including org.apache.solr:solr-solrj:jar:4.6.1 in the shaded jar.
[INFO] Including org.apache.zookeeper:zookeeper:jar:3.4.5 in the shaded jar.
[INFO] Including org.noggit:noggit:jar:0.5 in the shaded jar.
[INFO] Including org.apache.httpcomponents:httpmime:jar:4.2.6 in the shaded jar.
[INFO] Including org.codehaus.woodstox:wstx-asl:jar:3.2.7 in the shaded jar.
[INFO] Including org.apache.jena:jena-spatial:jar:1.0.2-SNAPSHOT in the shaded jar.
[INFO] Including org.apache.lucene:lucene-spatial:jar:4.6.1 in the shaded jar.
[INFO] Including com.spatial4j:spatial4j:jar:0.4 in the shaded jar.
[INFO] Including org.apache.httpcomponents:httpclient:jar:4.2.6 in the shaded jar.
[INFO] Including org.apache.httpcomponents:httpcore:jar:4.2.5 in the shaded jar.
[INFO] Including commons-codec:commons-codec:jar:1.6 in the shaded jar.
[INFO] Including commons-fileupload:commons-fileupload:jar:1.3.1 in the shaded jar.
[INFO] Including commons-io:commons-io:jar:2.2 in the shaded jar.
[INFO] Including org.eclipse.jetty:jetty-server:jar:8.1.14.v20131031 in the shaded jar.
[INFO] Including org.eclipse.jetty.orbit:javax.servlet:jar:3.0.0.v201112011016 in the shaded
jar.
[INFO] Including org.eclipse.jetty:jetty-continuation:jar:8.1.14.v20131031 in the shaded jar.
[INFO] Including org.eclipse.jetty:jetty-http:jar:8.1.14.v20131031 in the shaded jar.
[INFO] Including org.eclipse.jetty:jetty-io:jar:8.1.14.v20131031 in the shaded jar.
[INFO] Including org.eclipse.jetty:jetty-servlet:jar:8.1.14.v20131031 in the shaded jar.
[INFO] Including org.eclipse.jetty:jetty-servlets:jar:8.1.14.v20131031 in the shaded jar.
[INFO] Including org.eclipse.jetty:jetty-client:jar:8.1.14.v20131031 in the shaded jar.
[INFO] Including org.eclipse.jetty:jetty-xml:jar:8.1.14.v20131031 in the shaded jar.
[INFO] Including org.eclipse.jetty:jetty-security:jar:8.1.14.v20131031 in the shaded jar.
[INFO] Including org.eclipse.jetty:jetty-util:jar:8.1.14.v20131031 in the shaded jar.
[INFO] Including org.apache.velocity:velocity:jar:1.7 in the shaded jar.
[INFO] Including commons-collections:commons-collections:jar:3.2.1 in the shaded jar.
[INFO] Including commons-lang:commons-lang:jar:2.4 in the shaded jar.
[INFO] Including org.slf4j:slf4j-api:jar:1.7.6 in the shaded jar.
[INFO] Including org.slf4j:slf4j-log4j12:jar:1.7.6 in the shaded jar.
[INFO] Including org.slf4j:jcl-over-slf4j:jar:1.7.6 in the shaded jar.
[INFO] Including log4j:log4j:jar:1.2.17 in the shaded jar.
[INFO] Attaching shaded artifact.
[INFO] 
[INFO] --- maven-assembly-plugin:2.2.1:single (create-zip-assembly) @ jena-fuseki ---
[INFO] Reading assembly descriptor: assembly-dist.xml
[INFO] Building zip: <https://builds.apache.org/job/Jena_Development_Deploy/ws/trunk/jena-fuseki/target/jena-fuseki-1.0.2-SNAPSHOT-distribution.zip>
[INFO] Building tar : <https://builds.apache.org/job/Jena_Development_Deploy/ws/trunk/jena-fuseki/target/jena-fuseki-1.0.2-SNAPSHOT-distribution.tar.gz>
[INFO] 
[INFO] --- maven-install-plugin:2.3.1:install (default-install) @ jena-fuseki ---
[INFO] Installing <https://builds.apache.org/job/Jena_Development_Deploy/ws/trunk/jena-fuseki/target/jena-fuseki-1.0.2-SNAPSHOT.jar>
to /home/jenkins/jenkins-slave/maven-repositories/1/org/apache/jena/jena-fuseki/1.0.2-SNAPSHOT/jena-fuseki-1.0.2-SNAPSHOT.jar
[INFO] Installing <https://builds.apache.org/job/Jena_Development_Deploy/ws/trunk/jena-fuseki/pom.xml>
to /home/jenkins/jenkins-slave/maven-repositories/1/org/apache/jena/jena-fuseki/1.0.2-SNAPSHOT/jena-fuseki-1.0.2-SNAPSHOT.pom
[INFO] Installing <https://builds.apache.org/job/Jena_Development_Deploy/ws/trunk/jena-fuseki/target/jena-fuseki-1.0.2-SNAPSHOT-sources.jar>
to /home/jenkins/jenkins-slave/maven-repositories/1/org/apache/jena/jena-fuseki/1.0.2-SNAPSHOT/jena-fuseki-1.0.2-SNAPSHOT-sources.jar
[INFO] Installing <https://builds.apache.org/job/Jena_Development_Deploy/ws/trunk/jena-fuseki/target/jena-fuseki-1.0.2-SNAPSHOT-javadoc.jar>
to /home/jenkins/jenkins-slave/maven-repositories/1/org/apache/jena/jena-fuseki/1.0.2-SNAPSHOT/jena-fuseki-1.0.2-SNAPSHOT-javadoc.jar
[INFO] Installing <https://builds.apache.org/job/Jena_Development_Deploy/ws/trunk/jena-fuseki/target/jena-fuseki-1.0.2-SNAPSHOT-tests.jar>
to /home/jenkins/jenkins-slave/maven-repositories/1/org/apache/jena/jena-fuseki/1.0.2-SNAPSHOT/jena-fuseki-1.0.2-SNAPSHOT-tests.jar
[INFO] Installing <https://builds.apache.org/job/Jena_Development_Deploy/ws/trunk/jena-fuseki/target/jena-fuseki-1.0.2-SNAPSHOT-server.jar>
to /home/jenkins/jenkins-slave/maven-repositories/1/org/apache/jena/jena-fuseki/1.0.2-SNAPSHOT/jena-fuseki-1.0.2-SNAPSHOT-server.jar
[INFO] Installing <https://builds.apache.org/job/Jena_Development_Deploy/ws/trunk/jena-fuseki/target/jena-fuseki-1.0.2-SNAPSHOT-distribution.zip>
to /home/jenkins/jenkins-slave/maven-repositories/1/org/apache/jena/jena-fuseki/1.0.2-SNAPSHOT/jena-fuseki-1.0.2-SNAPSHOT-distribution.zip
[INFO] Installing <https://builds.apache.org/job/Jena_Development_Deploy/ws/trunk/jena-fuseki/target/jena-fuseki-1.0.2-SNAPSHOT-distribution.tar.gz>
to /home/jenkins/jenkins-slave/maven-repositories/1/org/apache/jena/jena-fuseki/1.0.2-SNAPSHOT/jena-fuseki-1.0.2-SNAPSHOT-distribution.tar.gz
[INFO] 
[INFO] --- maven-deploy-plugin:2.7:deploy (default-deploy) @ jena-fuseki ---
[INFO] Downloading: https://repository.apache.org/content/repositories/snapshots/org/apache/jena/jena-fuseki/1.0.2-SNAPSHOT/maven-metadata.xml
[INFO] Downloaded: https://repository.apache.org/content/repositories/snapshots/org/apache/jena/jena-fuseki/1.0.2-SNAPSHOT/maven-metadata.xml
(3 KB at 4.9 KB/sec)
[INFO] Uploading: https://repository.apache.org/content/repositories/snapshots/org/apache/jena/jena-fuseki/1.0.2-SNAPSHOT/jena-fuseki-1.0.2-20140410.094003-52.jar
[INFO] Uploaded: https://repository.apache.org/content/repositories/snapshots/org/apache/jena/jena-fuseki/1.0.2-SNAPSHOT/jena-fuseki-1.0.2-20140410.094003-52.jar
(181 KB at 466.7 KB/sec)
[INFO] Uploading: https://repository.apache.org/content/repositories/snapshots/org/apache/jena/jena-fuseki/1.0.2-SNAPSHOT/jena-fuseki-1.0.2-20140410.094003-52.pom
[INFO] Uploaded: https://repository.apache.org/content/repositories/snapshots/org/apache/jena/jena-fuseki/1.0.2-SNAPSHOT/jena-fuseki-1.0.2-20140410.094003-52.pom
(13 KB at 28.4 KB/sec)
[INFO] Downloading: https://repository.apache.org/content/repositories/snapshots/org/apache/jena/jena-fuseki/maven-metadata.xml
[INFO] Downloaded: https://repository.apache.org/content/repositories/snapshots/org/apache/jena/jena-fuseki/maven-metadata.xml
(346 B at 0.8 KB/sec)
[INFO] Uploading: https://repository.apache.org/content/repositories/snapshots/org/apache/jena/jena-fuseki/1.0.2-SNAPSHOT/maven-metadata.xml
[INFO] Uploaded: https://repository.apache.org/content/repositories/snapshots/org/apache/jena/jena-fuseki/1.0.2-SNAPSHOT/maven-metadata.xml
(3 KB at 7.3 KB/sec)
[INFO] Uploading: https://repository.apache.org/content/repositories/snapshots/org/apache/jena/jena-fuseki/maven-metadata.xml
[INFO] Uploaded: https://repository.apache.org/content/repositories/snapshots/org/apache/jena/jena-fuseki/maven-metadata.xml
(346 B at 1.0 KB/sec)
[INFO] Uploading: https://repository.apache.org/content/repositories/snapshots/org/apache/jena/jena-fuseki/1.0.2-SNAPSHOT/jena-fuseki-1.0.2-20140410.094003-52-sources.jar
[INFO] Uploaded: https://repository.apache.org/content/repositories/snapshots/org/apache/jena/jena-fuseki/1.0.2-SNAPSHOT/jena-fuseki-1.0.2-20140410.094003-52-sources.jar
(130 KB at 282.8 KB/sec)
[INFO] Uploading: https://repository.apache.org/content/repositories/snapshots/org/apache/jena/jena-fuseki/1.0.2-SNAPSHOT/maven-metadata.xml
[INFO] Uploaded: https://repository.apache.org/content/repositories/snapshots/org/apache/jena/jena-fuseki/1.0.2-SNAPSHOT/maven-metadata.xml
(3 KB at 6.7 KB/sec)
[INFO] Uploading: https://repository.apache.org/content/repositories/snapshots/org/apache/jena/jena-fuseki/1.0.2-SNAPSHOT/jena-fuseki-1.0.2-20140410.094003-52-javadoc.jar
[INFO] Uploaded: https://repository.apache.org/content/repositories/snapshots/org/apache/jena/jena-fuseki/1.0.2-SNAPSHOT/jena-fuseki-1.0.2-20140410.094003-52-javadoc.jar
(387 KB at 667.8 KB/sec)
[INFO] Uploading: https://repository.apache.org/content/repositories/snapshots/org/apache/jena/jena-fuseki/1.0.2-SNAPSHOT/maven-metadata.xml
[INFO] Uploaded: https://repository.apache.org/content/repositories/snapshots/org/apache/jena/jena-fuseki/1.0.2-SNAPSHOT/maven-metadata.xml
(3 KB at 6.8 KB/sec)
[INFO] Uploading: https://repository.apache.org/content/repositories/snapshots/org/apache/jena/jena-fuseki/1.0.2-SNAPSHOT/jena-fuseki-1.0.2-20140410.094003-52-tests.jar
[INFO] Uploaded: https://repository.apache.org/content/repositories/snapshots/org/apache/jena/jena-fuseki/1.0.2-SNAPSHOT/jena-fuseki-1.0.2-20140410.094003-52-tests.jar
(27 KB at 74.9 KB/sec)
[INFO] Uploading: https://repository.apache.org/content/repositories/snapshots/org/apache/jena/jena-fuseki/1.0.2-SNAPSHOT/maven-metadata.xml
[INFO] Uploaded: https://repository.apache.org/content/repositories/snapshots/org/apache/jena/jena-fuseki/1.0.2-SNAPSHOT/maven-metadata.xml
(3 KB at 6.6 KB/sec)
[INFO] Uploading: https://repository.apache.org/content/repositories/snapshots/org/apache/jena/jena-fuseki/1.0.2-SNAPSHOT/jena-fuseki-1.0.2-20140410.094003-52-server.jar
[INFO] Uploaded: https://repository.apache.org/content/repositories/snapshots/org/apache/jena/jena-fuseki/1.0.2-SNAPSHOT/jena-fuseki-1.0.2-20140410.094003-52-server.jar
(18740 KB at 3842.5 KB/sec)
[INFO] Uploading: https://repository.apache.org/content/repositories/snapshots/org/apache/jena/jena-fuseki/1.0.2-SNAPSHOT/maven-metadata.xml
[INFO] Uploaded: https://repository.apache.org/content/repositories/snapshots/org/apache/jena/jena-fuseki/1.0.2-SNAPSHOT/maven-metadata.xml
(3 KB at 6.6 KB/sec)
[INFO] Uploading: https://repository.apache.org/content/repositories/snapshots/org/apache/jena/jena-fuseki/1.0.2-SNAPSHOT/jena-fuseki-1.0.2-20140410.094003-52-distribution.zip
[INFO] Uploaded: https://repository.apache.org/content/repositories/snapshots/org/apache/jena/jena-fuseki/1.0.2-SNAPSHOT/jena-fuseki-1.0.2-20140410.094003-52-distribution.zip
(16852 KB at 4591.7 KB/sec)
[INFO] Uploading: https://repository.apache.org/content/repositories/snapshots/org/apache/jena/jena-fuseki/1.0.2-SNAPSHOT/maven-metadata.xml
[INFO] Uploaded: https://repository.apache.org/content/repositories/snapshots/org/apache/jena/jena-fuseki/1.0.2-SNAPSHOT/maven-metadata.xml
(3 KB at 6.7 KB/sec)
[INFO] Uploading: https://repository.apache.org/content/repositories/snapshots/org/apache/jena/jena-fuseki/1.0.2-SNAPSHOT/jena-fuseki-1.0.2-20140410.094003-52-distribution.tar.gz
[INFO] Uploaded: https://repository.apache.org/content/repositories/snapshots/org/apache/jena/jena-fuseki/1.0.2-SNAPSHOT/jena-fuseki-1.0.2-20140410.094003-52-distribution.tar.gz
(16809 KB at 6648.7 KB/sec)
[INFO] Uploading: https://repository.apache.org/content/repositories/snapshots/org/apache/jena/jena-fuseki/1.0.2-SNAPSHOT/maven-metadata.xml
[INFO] Uploaded: https://repository.apache.org/content/repositories/snapshots/org/apache/jena/jena-fuseki/1.0.2-SNAPSHOT/maven-metadata.xml
(3 KB at 6.7 KB/sec)
[JENKINS] Archiving disabled
[INFO]                                                                         
[INFO] ------------------------------------------------------------------------
[INFO] Building Apache Jena - Security 2.11.2-SNAPSHOT
[INFO] ------------------------------------------------------------------------
[INFO] 
[INFO] --- maven-clean-plugin:2.5:clean (default-clean) @ jena-security ---
[INFO] 
[INFO] --- maven-enforcer-plugin:1.2:enforce (enforce) @ jena-security ---
[INFO] 
[INFO] --- maven-remote-resources-plugin:1.4:process (default) @ jena-security ---
[INFO] 
[INFO] --- maven-resources-plugin:2.6:resources (default-resources) @ jena-security ---
[INFO] Using 'UTF-8' encoding to copy filtered resources.
[INFO] skip non existing resourceDirectory <https://builds.apache.org/job/Jena_Development_Deploy/ws/trunk/jena-security/src/main/resources>
[INFO] Copying 3 resources
[INFO] 
[INFO] --- maven-compiler-plugin:3.1:compile (default-compile) @ jena-security ---
[INFO] Changes detected - recompiling the module!
[INFO] Compiling 60 source files to <https://builds.apache.org/job/Jena_Development_Deploy/ws/trunk/jena-security/target/classes>
[INFO] -------------------------------------------------------------
[WARNING] COMPILATION WARNING : 
[INFO] -------------------------------------------------------------
[WARNING] <https://builds.apache.org/job/Jena_Development_Deploy/ws/trunk/jena-security/src/main/java/org/apache/jena/security/model/impl/SecuredSeqImpl.java>:
Some input files use or override a deprecated API.
[WARNING] <https://builds.apache.org/job/Jena_Development_Deploy/ws/trunk/jena-security/src/main/java/org/apache/jena/security/model/impl/SecuredSeqImpl.java>:
Recompile with -Xlint:deprecation for details.
[WARNING] <https://builds.apache.org/job/Jena_Development_Deploy/ws/trunk/jena-security/src/main/java/org/apache/jena/security/impl/CachedSecurityEvaluator.java>:
<https://builds.apache.org/job/Jena_Development_Deploy/ws/trunk/jena-security/src/main/java/org/apache/jena/security/impl/CachedSecurityEvaluator.java>
uses unchecked or unsafe operations.
[WARNING] <https://builds.apache.org/job/Jena_Development_Deploy/ws/trunk/jena-security/src/main/java/org/apache/jena/security/impl/CachedSecurityEvaluator.java>:
Recompile with -Xlint:unchecked for details.
[INFO] 4 warnings 
[INFO] -------------------------------------------------------------
[INFO] -------------------------------------------------------------
[ERROR] COMPILATION ERROR : 
[INFO] -------------------------------------------------------------
[ERROR] <https://builds.apache.org/job/Jena_Development_Deploy/ws/trunk/jena-security/src/main/java/org/apache/jena/security/query/rewriter/SecuredFunction.java>:[40,8]
org.apache.jena.security.query.rewriter.SecuredFunction is not abstract and does not override
abstract method eval(java.util.List<com.hp.hpl.jena.sparql.expr.NodeValue>) in com.hp.hpl.jena.sparql.expr.ExprFunctionN
[INFO] 1 error
[INFO] -------------------------------------------------------------
[JENKINS] Archiving disabled
[JENKINS] Archiving disabled
[JENKINS] Archiving disabled
[JENKINS] Archiving disabled
[JENKINS] Archiving disabled
[JENKINS] Archiving disabled
[JENKINS] Archiving disabled
[JENKINS] Archiving disabled
[JENKINS] Archiving disabled
[JENKINS] Archiving disabled
[JENKINS] Archiving disabled
[JENKINS] Archiving disabled
[JENKINS] Archiving disabled
[JENKINS] Archiving disabled
[JENKINS] Archiving disabled
[JENKINS] Archiving disabled
[JENKINS] Archiving disabled
[JENKINS] Archiving disabled
[JENKINS] Archiving disabled
[JENKINS] Archiving disabled
[JENKINS] Archiving disabled[INFO] ------------------------------------------------------------------------
[INFO] Reactor Summary:
[INFO] 
[INFO] Apache Jena - Parent .............................. SUCCESS [40.498s]
[INFO] Apache Jena - IRI ................................. SUCCESS [28.269s]
[INFO] Apache Jena - Core ................................ SUCCESS [1:22.269s]
[INFO] Apache Jena - ARQ (SPARQL 1.1 Query Engine) ....... SUCCESS [1:33.072s]
[INFO] Apache Jena - TDB (Native Triple Store) ........... SUCCESS [2:14.755s]
[INFO] Apache Jena - Libraries POM ....................... SUCCESS [5.869s]
[INFO] Apache Jena - SPARQL Text Search .................. SUCCESS [31.859s]
[INFO] Apache Jena - SPARQL Spatial Search ............... SUCCESS [42.056s]
[INFO] Apache Jena - SDB (SQL based triple store) ........ SUCCESS [2:00.064s]
[INFO] Apache Jena - Fuseki (SPARQL 1.1 Server) .......... SUCCESS [2:34.656s]
[INFO] Apache Jena - Security ............................ FAILURE [4.102s]
[INFO] Apache Jena - JDBC Parent ......................... SKIPPED
[INFO] Apache Jena - JDBC Core API ....................... SKIPPED
[INFO] Apache Jena - JDBC Remote Endpoint Driver ......... SKIPPED
[INFO] Apache Jena - JDBC In-Memory Driver ............... SKIPPED
[INFO] Apache Jena - JDBC TDB Driver ..................... SKIPPED
[INFO] Apache Jena - JDBC Driver Bundle .................. SKIPPED
[INFO] Apache Jena - Maven Plugins, including schemagen .. SKIPPED
[INFO] Apache Jena - Distribution ........................ SKIPPED
[INFO] Apache Jena ....................................... SKIPPED
[INFO] ------------------------------------------------------------------------
[INFO] BUILD FAILURE
[INFO] ------------------------------------------------------------------------
[INFO] Total time: 12:57.569s
[INFO] Finished at: Thu Apr 10 09:41:33 UTC 2014

[INFO] Final Memory: 71M/358M
[INFO] ------------------------------------------------------------------------
Waiting for Jenkins to finish collecting data
[ERROR] Failed to execute goal org.apache.maven.plugins:maven-compiler-plugin:3.1:compile
(default-compile) on project jena-security: Compilation failure
[ERROR] <https://builds.apache.org/job/Jena_Development_Deploy/ws/trunk/jena-security/src/main/java/org/apache/jena/security/query/rewriter/SecuredFunction.java>:[40,8]
org.apache.jena.security.query.rewriter.SecuredFunction is not abstract and does not override
abstract method eval(java.util.List<com.hp.hpl.jena.sparql.expr.NodeValue>) in com.hp.hpl.jena.sparql.expr.ExprFunctionN
[ERROR] -> [Help 1]
[ERROR] 
[ERROR] To see the full stack trace of the errors, re-run Maven with the -e switch.
[ERROR] Re-run Maven using the -X switch to enable full debug logging.
[ERROR] 
[ERROR] For more information about the errors and possible solutions, please read the following
articles:
[ERROR] [Help 1] http://cwiki.apache.org/confluence/display/MAVEN/MojoFailureException
[ERROR] 
[ERROR] After correcting the problems, you can resume the build with the command
[ERROR]   mvn <goals> -rf :jena-security
Sending e-mails to: commits@jena.apache.org
channel stopped

Mime
View raw message