jena-commits mailing list archives

Site index · List index
Message view « Date » · « Thread »
Top « Date » · « Thread »
From Apache Jenkins Server <jenk...@builds.apache.org>
Subject Build failed in Jenkins: Jena_Development_Test #1214
Date Wed, 09 Apr 2014 17:42:13 GMT
See <https://builds.apache.org/job/Jena_Development_Test/1214/changes>

Changes:

[andy] Make ExprFunctionN.eval(List<NodeValue) public.

Note for some functions which are special forms, this is a meaningless operation.

------------------------------------------
[...truncated 421 lines...]
[INFO] --- maven-surefire-plugin:2.15:test (default-test) @ jena-text ---
[INFO] Surefire report directory: <https://builds.apache.org/job/Jena_Development_Test/ws/trunk/jena-text/target/surefire-reports>

-------------------------------------------------------
 T E S T S
-------------------------------------------------------
Running org.apache.jena.query.text.TS_Text
Tests run: 89, Failures: 0, Errors: 0, Skipped: 0, Time elapsed: 6.982 sec - in org.apache.jena.query.text.TS_Text

Results :

Tests run: 89, Failures: 0, Errors: 0, Skipped: 0

[JENKINS] Recording test results
[JENKINS] Archiving disabled
[INFO]                                                                         
[INFO] ------------------------------------------------------------------------
[INFO] Building Apache Jena - SPARQL Spatial Search 1.0.2-SNAPSHOT
[INFO] ------------------------------------------------------------------------
[INFO] 
[INFO] --- maven-clean-plugin:2.5:clean (default-clean) @ jena-spatial ---
[INFO] 
[INFO] --- maven-enforcer-plugin:1.2:enforce (enforce) @ jena-spatial ---
[INFO] 
[INFO] --- maven-remote-resources-plugin:1.4:process (default) @ jena-spatial ---
[INFO] 
[INFO] --- maven-resources-plugin:2.6:resources (default-resources) @ jena-spatial ---
[INFO] Using 'UTF-8' encoding to copy filtered resources.
[INFO] Copying 1 resource
[INFO] Copying 0 resource
[INFO] Copying 3 resources
[INFO] 
[INFO] --- maven-compiler-plugin:3.1:compile (default-compile) @ jena-spatial ---
[INFO] Changes detected - recompiling the module!
[INFO] Compiling 37 source files to <https://builds.apache.org/job/Jena_Development_Test/ws/trunk/jena-spatial/target/classes>
[INFO] 
[INFO] --- maven-resources-plugin:2.6:testResources (default-testResources) @ jena-spatial
---
[INFO] Using 'UTF-8' encoding to copy filtered resources.
[INFO] Copying 9 resources
[INFO] Copying 3 resources
[INFO] 
[INFO] --- maven-compiler-plugin:3.1:testCompile (default-testCompile) @ jena-spatial ---
[INFO] Changes detected - recompiling the module!
[INFO] Compiling 37 source files to <https://builds.apache.org/job/Jena_Development_Test/ws/trunk/jena-spatial/target/test-classes>
[INFO] 
[INFO] --- maven-surefire-plugin:2.15:test (default-test) @ jena-spatial ---
[INFO] Surefire report directory: <https://builds.apache.org/job/Jena_Development_Test/ws/trunk/jena-spatial/target/surefire-reports>

-------------------------------------------------------
 T E S T S
-------------------------------------------------------
Running org.apache.jena.query.spatial.TS_Spatial
Tests run: 53, Failures: 0, Errors: 0, Skipped: 0, Time elapsed: 13.768 sec - in org.apache.jena.query.spatial.TS_Spatial

Results :

Tests run: 53, Failures: 0, Errors: 0, Skipped: 0

[JENKINS] Recording test results
[JENKINS] Archiving disabled
[INFO]                                                                         
[INFO] ------------------------------------------------------------------------
[INFO] Building Apache Jena - SDB (SQL based triple store) 1.4.2-SNAPSHOT
[INFO] ------------------------------------------------------------------------
[INFO] 
[INFO] --- maven-clean-plugin:2.5:clean (default-clean) @ jena-sdb ---
[INFO] 
[INFO] --- maven-enforcer-plugin:1.2:enforce (enforce) @ jena-sdb ---
[INFO] 
[INFO] --- maven-remote-resources-plugin:1.4:process (default) @ jena-sdb ---
[INFO] 
[INFO] --- maven-resources-plugin:2.6:resources (default-resources) @ jena-sdb ---
[INFO] Using 'UTF-8' encoding to copy filtered resources.
[INFO] Copying 1 resource to com/hp/hpl/jena/sdb/
[INFO] Copying 3 resources
[INFO] 
[INFO] --- maven-compiler-plugin:3.1:compile (default-compile) @ jena-sdb ---
[INFO] Changes detected - recompiling the module!
[INFO] Compiling 348 source files to <https://builds.apache.org/job/Jena_Development_Test/ws/trunk/jena-sdb/target/classes>
[INFO] 
[INFO] --- maven-resources-plugin:2.6:testResources (default-testResources) @ jena-sdb ---
[INFO] Using 'UTF-8' encoding to copy filtered resources.
[INFO] skip non existing resourceDirectory <https://builds.apache.org/job/Jena_Development_Test/ws/trunk/jena-sdb/src/test/resources>
[INFO] Copying 3 resources
[INFO] 
[INFO] --- maven-compiler-plugin:3.1:testCompile (default-testCompile) @ jena-sdb ---
[INFO] Changes detected - recompiling the module!
[INFO] Compiling 68 source files to <https://builds.apache.org/job/Jena_Development_Test/ws/trunk/jena-sdb/target/test-classes>
[INFO] 
[INFO] --- maven-surefire-plugin:2.15:test (default-test) @ jena-sdb ---
[INFO] Surefire report directory: <https://builds.apache.org/job/Jena_Development_Test/ws/trunk/jena-sdb/target/surefire-reports>

-------------------------------------------------------
 T E S T S
-------------------------------------------------------
Running com.hp.hpl.jena.sdb.test.SDBTestAll
Tests run: 524, Failures: 0, Errors: 0, Skipped: 0, Time elapsed: 43.144 sec - in com.hp.hpl.jena.sdb.test.SDBTestAll

Results :

Tests run: 524, Failures: 0, Errors: 0, Skipped: 0

[JENKINS] Recording test results
[JENKINS] Archiving disabled
[INFO]                                                                         
[INFO] ------------------------------------------------------------------------
[INFO] Building Apache Jena - Fuseki (SPARQL 1.1 Server) 1.0.2-SNAPSHOT
[INFO] ------------------------------------------------------------------------
[INFO] 
[INFO] --- maven-clean-plugin:2.5:clean (default-clean) @ jena-fuseki ---
[INFO] 
[INFO] --- maven-enforcer-plugin:1.2:enforce (enforce) @ jena-fuseki ---
[INFO] 
[INFO] --- maven-remote-resources-plugin:1.4:process (default) @ jena-fuseki ---
[INFO] 
[INFO] --- maven-resources-plugin:2.5:resources (default-resources) @ jena-fuseki ---
[debug] execute contextualize
[INFO] Using 'UTF-8' encoding to copy filtered resources.
[INFO] Copying 0 resource
[INFO] Copying 1 resource
[INFO] Copying 3 resources
[INFO] 
[INFO] --- maven-compiler-plugin:2.3.2:compile (default-compile) @ jena-fuseki ---
[INFO] Compiling 69 source files to <https://builds.apache.org/job/Jena_Development_Test/ws/trunk/jena-fuseki/target/classes>
[INFO] 
[INFO] --- maven-resources-plugin:2.5:testResources (default-testResources) @ jena-fuseki
---
[debug] execute contextualize
[INFO] Using 'UTF-8' encoding to copy filtered resources.
[INFO] Copying 1 resource
[INFO] Copying 3 resources
[INFO] 
[INFO] --- maven-compiler-plugin:2.3.2:testCompile (default-testCompile) @ jena-fuseki ---
[INFO] Compiling 8 source files to <https://builds.apache.org/job/Jena_Development_Test/ws/trunk/jena-fuseki/target/test-classes>
[INFO] 
[INFO] --- maven-surefire-plugin:2.9:test (default-test) @ jena-fuseki ---
[INFO] Surefire report directory: <https://builds.apache.org/job/Jena_Development_Test/ws/trunk/jena-fuseki/target/surefire-reports>

-------------------------------------------------------
 T E S T S
-------------------------------------------------------
Running org.apache.jena.fuseki.TS_Fuseki
Tests run: 82, Failures: 0, Errors: 0, Skipped: 0, Time elapsed: 3.357 sec

Results :

Tests run: 82, Failures: 0, Errors: 0, Skipped: 0

[JENKINS] Recording test results
[JENKINS] Archiving disabled
[INFO]                                                                         
[INFO] ------------------------------------------------------------------------
[INFO] Building Apache Jena - Security 2.11.2-SNAPSHOT
[INFO] ------------------------------------------------------------------------
[INFO] 
[INFO] --- maven-clean-plugin:2.5:clean (default-clean) @ jena-security ---
[INFO] 
[INFO] --- maven-enforcer-plugin:1.2:enforce (enforce) @ jena-security ---
[INFO] 
[INFO] --- maven-remote-resources-plugin:1.4:process (default) @ jena-security ---
[INFO] 
[INFO] --- maven-resources-plugin:2.6:resources (default-resources) @ jena-security ---
[INFO] Using 'UTF-8' encoding to copy filtered resources.
[INFO] skip non existing resourceDirectory <https://builds.apache.org/job/Jena_Development_Test/ws/trunk/jena-security/src/main/resources>
[INFO] Copying 3 resources
[INFO] 
[INFO] --- maven-compiler-plugin:3.1:compile (default-compile) @ jena-security ---
[INFO] Changes detected - recompiling the module!
[INFO] Compiling 60 source files to <https://builds.apache.org/job/Jena_Development_Test/ws/trunk/jena-security/target/classes>
[INFO] -------------------------------------------------------------
[WARNING] COMPILATION WARNING : 
[INFO] -------------------------------------------------------------
[WARNING] Note: Some input files use or override a deprecated API.
[WARNING] Note: Recompile with -Xlint:deprecation for details.
[WARNING] Note: <https://builds.apache.org/job/Jena_Development_Test/ws/trunk/jena-security/src/main/java/org/apache/jena/security/impl/CachedSecurityEvaluator.java>
uses unchecked or unsafe operations.
[WARNING] Note: Recompile with -Xlint:unchecked for details.
[INFO] 4 warnings 
[INFO] -------------------------------------------------------------
[INFO] -------------------------------------------------------------
[ERROR] COMPILATION ERROR : 
[INFO] -------------------------------------------------------------
[ERROR] <https://builds.apache.org/job/Jena_Development_Test/ws/trunk/jena-security/src/main/java/org/apache/jena/security/query/rewriter/SecuredFunction.java>:[122,29]
eval(java.util.List<com.hp.hpl.jena.sparql.expr.NodeValue>) in org.apache.jena.security.query.rewriter.SecuredFunction
cannot override eval(java.util.List<com.hp.hpl.jena.sparql.expr.NodeValue>) in com.hp.hpl.jena.sparql.expr.ExprFunctionN;
attempting to assign weaker access privileges; was public
[INFO] 1 error
[INFO] -------------------------------------------------------------
[JENKINS] Archiving disabled
[JENKINS] Archiving disabled
[JENKINS] Archiving disabled
[JENKINS] Archiving disabled
[JENKINS] Archiving disabled
[JENKINS] Archiving disabled
[JENKINS] Archiving disabled
[JENKINS] Archiving disabled
[JENKINS] Archiving disabled
[JENKINS] Archiving disabled
[JENKINS] Archiving disabled
[JENKINS] Archiving disabled
[JENKINS] Archiving disabled
[JENKINS] Archiving disabled
[JENKINS] Archiving disabled
[JENKINS] Archiving disabled
[JENKINS] Archiving disabled
[JENKINS] Archiving disabled
[JENKINS] Archiving disabled
[JENKINS] Archiving disabled
[JENKINS] Archiving disabled[INFO] ------------------------------------------------------------------------
[INFO] Reactor Summary:
[INFO] 

[INFO] Apache Jena - Parent .............................. SUCCESS [8.058s]
[INFO] Apache Jena - IRI ................................. SUCCESS [14.376s]
[INFO] Apache Jena - Core ................................ SUCCESS [53.669s]
[INFO] Apache Jena - ARQ (SPARQL 1.1 Query Engine) ....... SUCCESS [51.476s]
[INFO] Apache Jena - TDB (Native Triple Store) ........... SUCCESS [1:28.448s]
[INFO] Apache Jena - Libraries POM ....................... SUCCESS [3.749s]
[INFO] Apache Jena - SPARQL Text Search .................. SUCCESS [11.441s]
[INFO] Apache Jena - SPARQL Spatial Search ............... SUCCESS [19.931s]
[INFO] Apache Jena - SDB (SQL based triple store) ........ SUCCESS [49.935s]
[INFO] Apache Jena - Fuseki (SPARQL 1.1 Server) .......... SUCCESS [11.441s]
[INFO] Apache Jena - Security ............................ FAILURE [9.087s]
[INFO] Apache Jena - JDBC Parent ......................... SKIPPED
[INFO] Apache Jena - JDBC Core API ....................... SKIPPED
[INFO] Apache Jena - JDBC Remote Endpoint Driver ......... SKIPPED
[INFO] Apache Jena - JDBC In-Memory Driver ............... SKIPPED
[INFO] Apache Jena - JDBC TDB Driver ..................... SKIPPED
[INFO] Apache Jena - JDBC Driver Bundle .................. SKIPPED
[INFO] Apache Jena - Maven Plugins, including schemagen .. SKIPPED
[INFO] Apache Jena - Distribution ........................ SKIPPED
[INFO] Apache Jena ....................................... SKIPPED
[INFO] ------------------------------------------------------------------------
[INFO] BUILD FAILURE
[INFO] ------------------------------------------------------------------------
[INFO] Total time: 5:37.218s
[INFO] Finished at: Wed Apr 09 17:40:47 UTC 2014
[INFO] Final Memory: 47M/455M
[INFO] ------------------------------------------------------------------------
Waiting for Jenkins to finish collecting data
[ERROR] Failed to execute goal org.apache.maven.plugins:maven-compiler-plugin:3.1:compile
(default-compile) on project jena-security: Compilation failure
[ERROR] <https://builds.apache.org/job/Jena_Development_Test/ws/trunk/jena-security/src/main/java/org/apache/jena/security/query/rewriter/SecuredFunction.java>:[122,29]
eval(java.util.List<com.hp.hpl.jena.sparql.expr.NodeValue>) in org.apache.jena.security.query.rewriter.SecuredFunction
cannot override eval(java.util.List<com.hp.hpl.jena.sparql.expr.NodeValue>) in com.hp.hpl.jena.sparql.expr.ExprFunctionN;
attempting to assign weaker access privileges; was public
[ERROR] -> [Help 1]
[ERROR] 
[ERROR] To see the full stack trace of the errors, re-run Maven with the -e switch.
[ERROR] Re-run Maven using the -X switch to enable full debug logging.
[ERROR] 
[ERROR] For more information about the errors and possible solutions, please read the following
articles:
[ERROR] [Help 1] http://cwiki.apache.org/confluence/display/MAVEN/MojoFailureException
[ERROR] 
[ERROR] After correcting the problems, you can resume the build with the command
[ERROR]   mvn <goals> -rf :jena-security
Sending e-mails to: commits@jena.apache.org
channel stopped

Mime
View raw message