jena-commits mailing list archives

Site index · List index
Message view « Date » · « Thread »
Top « Date » · « Thread »
From Apache Jenkins Server <jenk...@builds.apache.org>
Subject Build failed in Jenkins: Jena_Development_Java6 » Apache Jena - TDB (Native Triple Store) #86
Date Tue, 28 Jan 2014 05:37:29 GMT
See <https://builds.apache.org/job/Jena_Development_Java6/org.apache.jena$jena-tdb/86/>

------------------------------------------
[INFO]                                                                         
[INFO] ------------------------------------------------------------------------
[INFO] Building Apache Jena - TDB (Native Triple Store) 1.0.2-SNAPSHOT
[INFO] ------------------------------------------------------------------------
[INFO] 
[INFO] --- maven-clean-plugin:2.5:clean (default-clean) @ jena-tdb ---
[INFO] 
[INFO] --- maven-enforcer-plugin:1.2:enforce (enforce) @ jena-tdb ---
[INFO] 
[INFO] --- maven-remote-resources-plugin:1.4:process (default) @ jena-tdb ---
[INFO] 
[INFO] --- maven-resources-plugin:2.6:resources (default-resources) @ jena-tdb ---
[INFO] Using 'UTF-8' encoding to copy filtered resources.
[INFO] Copying 0 resource
[INFO] Copying 1 resource
[INFO] Copying 3 resources
[INFO] 
[INFO] --- maven-compiler-plugin:3.1:compile (default-compile) @ jena-tdb ---
[INFO] Changes detected - recompiling the module!
[INFO] Compiling 263 source files to <https://builds.apache.org/job/Jena_Development_Java6/org.apache.jena$jena-tdb/ws/target/classes>
[INFO] -------------------------------------------------------------
[ERROR] COMPILATION ERROR : 
[INFO] -------------------------------------------------------------
[ERROR] <https://builds.apache.org/job/Jena_Development_Java6/org.apache.jena$jena-tdb/ws/src/main/java/com/hp/hpl/jena/tdb/solver/OpExecutorTDB.java>:[207,42]
cannot find symbol
symbol  : method transform(com.hp.hpl.jena.sparql.expr.ExprList,com.hp.hpl.jena.sparql.core.BasicPattern)
location: class com.hp.hpl.jena.sparql.algebra.optimize.TransformFilterPlacement
[ERROR] <https://builds.apache.org/job/Jena_Development_Java6/org.apache.jena$jena-tdb/ws/src/main/java/com/hp/hpl/jena/tdb/solver/OpExecutorTDB.java>:[244,42]
cannot find symbol
symbol  : method transform(com.hp.hpl.jena.sparql.expr.ExprList,com.hp.hpl.jena.graph.Node,com.hp.hpl.jena.sparql.core.BasicPattern)
location: class com.hp.hpl.jena.sparql.algebra.optimize.TransformFilterPlacement
[INFO] 2 errors 
[INFO] -------------------------------------------------------------
[JENKINS] Archiving disabled

Mime
View raw message