jena-commits mailing list archives

Site index · List index
Message view « Date » · « Thread »
Top « Date » · « Thread »
From Apache Jenkins Server <jenk...@builds.apache.org>
Subject Build failed in Jenkins: Jena_Development_Test #1107
Date Sat, 18 Jan 2014 18:24:26 GMT
See <https://builds.apache.org/job/Jena_Development_Test/1107/changes>

Changes:

[andy] Adjust jena-sdb version

[andy] Adjust jena-parent version

------------------------------------------
[...truncated 816 lines...]
Running org.apache.jena.jdbc.mem.TestMemDriver
Tests run: 24, Failures: 0, Errors: 0, Skipped: 0, Time elapsed: 0.012 sec - in org.apache.jena.jdbc.mem.TestMemDriver

Results :

Tests run: 553, Failures: 0, Errors: 0, Skipped: 4

[JENKINS] Recording test results
[JENKINS] Archiving disabled
[INFO]                                                                         
[INFO] ------------------------------------------------------------------------
[INFO] Building Apache Jena - JDBC TDB Driver 1.0.1-SNAPSHOT
[INFO] ------------------------------------------------------------------------
[INFO] 
[INFO] --- maven-clean-plugin:2.5:clean (default-clean) @ jena-jdbc-driver-tdb ---
[INFO] 
[INFO] --- maven-enforcer-plugin:1.2:enforce (enforce) @ jena-jdbc-driver-tdb ---
[INFO] 
[INFO] --- maven-remote-resources-plugin:1.4:process (default) @ jena-jdbc-driver-tdb ---
[INFO] 
[INFO] --- maven-resources-plugin:2.6:resources (default-resources) @ jena-jdbc-driver-tdb
---
[INFO] Using 'UTF-8' encoding to copy filtered resources.
[INFO] Copying 0 resource
[INFO] Copying 3 resources
[INFO] 
[INFO] --- maven-compiler-plugin:3.1:compile (default-compile) @ jena-jdbc-driver-tdb ---
[INFO] Changes detected - recompiling the module!
[INFO] Compiling 3 source files to <https://builds.apache.org/job/Jena_Development_Test/ws/trunk/jena-jdbc/jena-jdbc-driver-tdb/target/classes>
[INFO] 
[INFO] --- maven-resources-plugin:2.6:testResources (default-testResources) @ jena-jdbc-driver-tdb
---
[INFO] Using 'UTF-8' encoding to copy filtered resources.
[INFO] Copying 1 resource
[INFO] Copying 3 resources
[INFO] 
[INFO] --- maven-compiler-plugin:3.1:testCompile (default-testCompile) @ jena-jdbc-driver-tdb
---
[INFO] Changes detected - recompiling the module!
[INFO] Compiling 9 source files to <https://builds.apache.org/job/Jena_Development_Test/ws/trunk/jena-jdbc/jena-jdbc-driver-tdb/target/test-classes>
[INFO] 
[INFO] --- maven-surefire-plugin:2.14:test (default-test) @ jena-jdbc-driver-tdb ---
[INFO] Surefire report directory: <https://builds.apache.org/job/Jena_Development_Test/ws/trunk/jena-jdbc/jena-jdbc-driver-tdb/target/surefire-reports>

-------------------------------------------------------
 T E S T S
-------------------------------------------------------
Running org.apache.jena.jdbc.tdb.metadata.TestTdbConnectionMetadata
Tests run: 2, Failures: 0, Errors: 0, Skipped: 0, Time elapsed: 0.888 sec
Running org.apache.jena.jdbc.tdb.results.TestTdbDiskResultSets
Tests run: 221, Failures: 0, Errors: 0, Skipped: 2, Time elapsed: 119.352 sec
Running org.apache.jena.jdbc.tdb.results.TestTdbMemResultSets
Tests run: 221, Failures: 0, Errors: 0, Skipped: 2, Time elapsed: 1.67 sec
Running org.apache.jena.jdbc.tdb.TestJenaJdbcTdbDriver
Tests run: 24, Failures: 0, Errors: 0, Skipped: 0, Time elapsed: 0.04 sec
Running org.apache.jena.jdbc.tdb.connections.TestTdbDiskConnection
Tests run: 99, Failures: 0, Errors: 0, Skipped: 0, Time elapsed: 52.355 sec
Running org.apache.jena.jdbc.tdb.connections.TestTdbMemConnection
Tests run: 99, Failures: 0, Errors: 0, Skipped: 0, Time elapsed: 5.709 sec

Results :

Tests run: 666, Failures: 0, Errors: 0, Skipped: 4

[JENKINS] Recording test results
[JENKINS] Archiving disabled
[INFO]                                                                         
[INFO] ------------------------------------------------------------------------
[INFO] Building Apache Jena - JDBC Driver Bundle 1.0.1-SNAPSHOT
[INFO] ------------------------------------------------------------------------
[INFO] 
[INFO] --- maven-clean-plugin:2.5:clean (default-clean) @ jena-jdbc-driver-bundle ---
[INFO] 
[INFO] --- maven-enforcer-plugin:1.2:enforce (enforce) @ jena-jdbc-driver-bundle ---
[INFO] 
[INFO] --- maven-remote-resources-plugin:1.4:process (default) @ jena-jdbc-driver-bundle ---
[INFO] 
[INFO] --- maven-resources-plugin:2.6:resources (default-resources) @ jena-jdbc-driver-bundle
---
[INFO] Using 'UTF-8' encoding to copy filtered resources.
[INFO] Copying 0 resource
[INFO] Copying 3 resources
[INFO] 
[INFO] --- maven-compiler-plugin:3.1:compile (default-compile) @ jena-jdbc-driver-bundle ---
[INFO] Nothing to compile - all classes are up to date
[INFO] 
[INFO] --- maven-resources-plugin:2.6:testResources (default-testResources) @ jena-jdbc-driver-bundle
---
[INFO] Using 'UTF-8' encoding to copy filtered resources.
[INFO] Copying 1 resource
[INFO] Copying 3 resources
[INFO] 
[INFO] --- maven-compiler-plugin:3.1:testCompile (default-testCompile) @ jena-jdbc-driver-bundle
---
[INFO] Changes detected - recompiling the module!
[INFO] Compiling 1 source file to <https://builds.apache.org/job/Jena_Development_Test/ws/trunk/jena-jdbc/jena-jdbc-driver-bundle/target/test-classes>
[INFO] 
[INFO] --- maven-surefire-plugin:2.15:test (default-test) @ jena-jdbc-driver-bundle ---
[INFO] Tests are skipped.
[JENKINS] Archiving disabled
[INFO]                                                                         
[INFO] ------------------------------------------------------------------------
[INFO] Building Apache Jena - Maven Plugins, including schemagen 0.5-SNAPSHOT
[INFO] ------------------------------------------------------------------------
[INFO] 
[INFO] --- maven-clean-plugin:2.5:clean (default-clean) @ jena-maven-tools ---
[INFO] 
[INFO] --- maven-enforcer-plugin:1.2:enforce (enforce) @ jena-maven-tools ---
[INFO] 
[INFO] --- maven-plugin-plugin:3.2:helpmojo (help-goal) @ jena-maven-tools ---
[INFO] Using 'UTF-8' encoding to read mojo metadata.
[INFO] Applying mojo extractor for language: java-annotations
[INFO] Mojo extractor for language: java-annotations found 0 mojo descriptors.
[INFO] Applying mojo extractor for language: java
[INFO] Mojo extractor for language: java found 0 mojo descriptors.
[INFO] Applying mojo extractor for language: bsh
[INFO] Mojo extractor for language: bsh found 0 mojo descriptors.
[INFO] 
[INFO] --- maven-plugin-plugin:3.2:descriptor (default-descriptor) @ jena-maven-tools ---
[INFO] Using 'UTF-8' encoding to read mojo metadata.
[INFO] Applying mojo extractor for language: java-annotations
[INFO] Mojo extractor for language: java-annotations found 0 mojo descriptors.
[INFO] Applying mojo extractor for language: java
[INFO] Mojo extractor for language: java found 0 mojo descriptors.
[INFO] Applying mojo extractor for language: bsh
[INFO] Mojo extractor for language: bsh found 0 mojo descriptors.
[INFO] 
[INFO] --- maven-remote-resources-plugin:1.4:process (default) @ jena-maven-tools ---
[INFO] 
[INFO] --- maven-resources-plugin:2.6:resources (default-resources) @ jena-maven-tools ---
[INFO] Using 'UTF-8' encoding to copy filtered resources.
[INFO] skip non existing resourceDirectory <https://builds.apache.org/job/Jena_Development_Test/ws/trunk/jena-maven-tools/src/main/resources>
[INFO] Copying 3 resources
[INFO] 
[INFO] --- maven-compiler-plugin:3.1:compile (default-compile) @ jena-maven-tools ---
[INFO] Changes detected - recompiling the module!
[INFO] Compiling 6 source files to <https://builds.apache.org/job/Jena_Development_Test/ws/trunk/jena-maven-tools/target/classes>
[INFO] 
[INFO] --- maven-plugin-plugin:3.2:descriptor (mojo-descriptor) @ jena-maven-tools ---
[INFO] Using 'UTF-8' encoding to read mojo metadata.
[INFO] Applying mojo extractor for language: java-annotations
[INFO] Mojo extractor for language: java-annotations found 2 mojo descriptors.
[INFO] Applying mojo extractor for language: java
[INFO] Mojo extractor for language: java found 0 mojo descriptors.
[INFO] Applying mojo extractor for language: bsh
[INFO] Mojo extractor for language: bsh found 0 mojo descriptors.
[INFO] 
[INFO] --- maven-resources-plugin:2.6:testResources (default-testResources) @ jena-maven-tools
---
[INFO] Using 'UTF-8' encoding to copy filtered resources.
[INFO] Copying 2 resources
[INFO] Copying 3 resources
[INFO] 
[INFO] --- maven-compiler-plugin:3.1:testCompile (default-testCompile) @ jena-maven-tools
---
[INFO] Changes detected - recompiling the module!
[INFO] Compiling 4 source files to <https://builds.apache.org/job/Jena_Development_Test/ws/trunk/jena-maven-tools/target/test-classes>
[INFO] 
[INFO] --- maven-surefire-plugin:2.15:test (default-test) @ jena-maven-tools ---
[INFO] Surefire report directory: <https://builds.apache.org/job/Jena_Development_Test/ws/trunk/jena-maven-tools/target/surefire-reports>

-------------------------------------------------------
 T E S T S
-------------------------------------------------------
Running org.apache.jena.tools.schemagen.SchemagenMojoTest
Tests run: 4, Failures: 0, Errors: 0, Skipped: 0, Time elapsed: 0.19 sec - in org.apache.jena.tools.schemagen.SchemagenMojoTest
Running org.apache.jena.tools.schemagen.SchemagenOptionsTest
log4j:WARN No appenders could be found for logger (com.hp.hpl.jena.util.FileManager).
log4j:WARN Please initialize the log4j system properly.
log4j:WARN See http://logging.apache.org/log4j/1.2/faq.html#noconfig for more info.
Tests run: 31, Failures: 0, Errors: 0, Skipped: 0, Time elapsed: 0.491 sec - in org.apache.jena.tools.schemagen.SchemagenOptionsTest
Running org.apache.jena.tools.schemagen.SourceTest
Tests run: 3, Failures: 0, Errors: 0, Skipped: 1, Time elapsed: 0.017 sec - in org.apache.jena.tools.schemagen.SourceTest
Running org.apache.jena.tools.schemagen.SourceParameterTest
Tests run: 37, Failures: 0, Errors: 0, Skipped: 0, Time elapsed: 0.188 sec - in org.apache.jena.tools.schemagen.SourceParameterTest

Results :

Tests run: 75, Failures: 0, Errors: 0, Skipped: 1

[JENKINS] Recording test results
[JENKINS] Archiving disabled
[INFO]                                                                         
[INFO] ------------------------------------------------------------------------
[INFO] Building Apache Jena - Distribution 2.11.1-SNAPSHOT
[INFO] ------------------------------------------------------------------------
[INFO] Downloading: http://repository.apache.org/snapshots/org/apache/jena/jena-sdb/1.4.2-SNAPSHOT/maven-metadata.xml
[INFO] Downloading: http://repository.apache.org/snapshots/org/apache/jena/jena-sdb/1.4.2-SNAPSHOT/jena-sdb-1.4.2-SNAPSHOT.pom
[WARNING] The POM for org.apache.jena:jena-sdb:jar:1.4.2-SNAPSHOT is missing, no dependency
information available
[WARNING] The POM for org.apache.jena:jena-sdb:jar:sources:1.4.2-SNAPSHOT is missing, no dependency
information available
[WARNING] The POM for org.apache.jena:jena-sdb:jar:javadoc:1.4.2-SNAPSHOT is missing, no dependency
information available
[INFO] Downloading: http://repository.apache.org/snapshots/org/apache/jena/jena-sdb/1.4.2-SNAPSHOT/jena-sdb-1.4.2-SNAPSHOT.jar
[INFO] Downloading: http://repository.apache.org/snapshots/org/apache/jena/jena-sdb/1.4.2-SNAPSHOT/jena-sdb-1.4.2-SNAPSHOT-sources.jar
[INFO] Downloading: http://repository.apache.org/snapshots/org/apache/jena/jena-sdb/1.4.2-SNAPSHOT/jena-sdb-1.4.2-SNAPSHOT-javadoc.jar
[JENKINS] Archiving disabled
[JENKINS] Archiving disabled
[JENKINS] Archiving disabled
[JENKINS] Archiving disabled
[JENKINS] Archiving disabled
[JENKINS] Archiving disabled
[JENKINS] Archiving disabled
[JENKINS] Archiving disabled
[JENKINS] Archiving disabled
[JENKINS] Archiving disabled
[JENKINS] Archiving disabled
[JENKINS] Archiving disabled
[JENKINS] Archiving disabled
[JENKINS] Archiving disabled
[JENKINS] Archiving disabled
[JENKINS] Archiving disabled
[JENKINS] Archiving disabled
[JENKINS] Archiving disabled
[JENKINS] Archiving disabled
[JENKINS] Archiving disabled
[INFO] ------------------------------------------------------------------------
[JENKINS] Archiving disabled[INFO] Reactor Summary:
[INFO] 
[INFO] Apache Jena - Parent .............................. SUCCESS [13.372s]
[INFO] Apache Jena - IRI ................................. SUCCESS [13.158s]
[INFO] Apache Jena - Core ................................ SUCCESS [53.170s]
[INFO] Apache Jena - ARQ (SPARQL 1.1 Query Engine) ....... SUCCESS [48.136s]
[INFO] Apache Jena - TDB (Native Triple Store) ........... SUCCESS [1:08.768s]
[INFO] Apache Jena - Libraries POM ....................... SUCCESS [0.463s]
[INFO] Apache Jena - SPARQL Text Search .................. SUCCESS [7.448s]
[INFO] Apache Jena - SPARQL Spatial Search ............... SUCCESS [11.200s]
[INFO] Apache Jena - SDB (SQL based triple store) ........ SUCCESS [39.075s]
[INFO] Apache Jena - Fuseki (SPARQL 1.1 Server) .......... SUCCESS [8.029s]
[INFO] Apache Jena - Security ............................ SUCCESS [23.443s]
[INFO] Apache Jena - JDBC Parent ......................... SUCCESS [0.295s]
[INFO] Apache Jena - JDBC Core API ....................... SUCCESS [2.713s]
[INFO] Apache Jena - JDBC Remote Endpoint Driver ......... SUCCESS [18.815s]
[INFO] Apache Jena - JDBC In-Memory Driver ............... SUCCESS [9.313s]
[INFO] Apache Jena - JDBC TDB Driver ..................... SUCCESS [3:02.922s]
[INFO] Apache Jena - JDBC Driver Bundle .................. SUCCESS [1.099s]
[INFO] Apache Jena - Maven Plugins, including schemagen .. SUCCESS [5.684s]
[INFO] Apache Jena - Distribution ........................ FAILURE [0.823s]
[INFO] Apache Jena ....................................... SKIPPED
[INFO] ------------------------------------------------------------------------
[INFO] BUILD FAILURE
[INFO] ------------------------------------------------------------------------
[INFO] Total time: 8:52.701s
[INFO] Finished at: Sat Jan 18 18:24:20 UTC 2014

[INFO] Final Memory: 68M/313M
[INFO] ------------------------------------------------------------------------
[ERROR] Failed to execute goal on project apache-jena: Could not resolve dependencies for
project org.apache.jena:apache-jena:pom:2.11.1-SNAPSHOT: The following artifacts could not
be resolved: org.apache.jena:jena-sdb:jar:1.4.2-SNAPSHOT, org.apache.jena:jena-sdb:jar:sources:1.4.2-SNAPSHOT,
org.apache.jena:jena-sdb:jar:javadoc:1.4.2-SNAPSHOT: Could not find artifact org.apache.jena:jena-sdb:jar:1.4.2-SNAPSHOT
in Nexus (http://repository.apache.org/snapshots) -> [Help 1]
[ERROR] 
[ERROR] To see the full stack trace of the errors, re-run Maven with the -e switch.
[ERROR] Re-run Maven using the -X switch to enable full debug logging.
[ERROR] 
[ERROR] For more information about the errors and possible solutions, please read the following
articles:
[ERROR] [Help 1] http://cwiki.apache.org/confluence/display/MAVEN/DependencyResolutionException
[ERROR] 
[ERROR] After correcting the problems, you can resume the build with the command
[ERROR]   mvn <goals> -rf :apache-jena
Sending e-mails to: commits@jena.apache.org
channel stopped

Mime
View raw message