jena-commits mailing list archives

Site index · List index
Message view « Date » · « Thread »
Top « Date » · « Thread »
From Apache Jenkins Server <jenk...@builds.apache.org>
Subject Build failed in Jenkins: Jena_Development_Java6 » Jena plugins for Apache Maven,including schemagen #55
Date Mon, 02 Dec 2013 09:08:59 GMT
See <https://builds.apache.org/job/Jena_Development_Java6/org.apache.jena$jena-maven-tools/55/>

------------------------------------------
[INFO]                                                                         
[INFO] ------------------------------------------------------------------------
[INFO] Building Jena plugins for Apache Maven,including schemagen 0.3-SNAPSHOT
[INFO] ------------------------------------------------------------------------
[INFO] 
[INFO] --- maven-clean-plugin:2.5:clean (default-clean) @ jena-maven-tools ---
[INFO] 
[INFO] --- maven-enforcer-plugin:1.2:enforce (enforce) @ jena-maven-tools ---
[INFO] 
[INFO] --- maven-plugin-plugin:3.2:helpmojo (help-goal) @ jena-maven-tools ---
[INFO] Using 'UTF-8' encoding to read mojo metadata.
[INFO] Applying mojo extractor for language: java-annotations
[INFO] Mojo extractor for language: java-annotations found 0 mojo descriptors.
[INFO] Applying mojo extractor for language: java
[INFO] Mojo extractor for language: java found 0 mojo descriptors.
[INFO] Applying mojo extractor for language: bsh
[INFO] Mojo extractor for language: bsh found 0 mojo descriptors.
[INFO] 
[INFO] --- maven-plugin-plugin:3.2:descriptor (default-descriptor) @ jena-maven-tools ---
[INFO] Using 'UTF-8' encoding to read mojo metadata.
[INFO] Applying mojo extractor for language: java-annotations
[INFO] Mojo extractor for language: java-annotations found 0 mojo descriptors.
[INFO] Applying mojo extractor for language: java
[INFO] Mojo extractor for language: java found 0 mojo descriptors.
[INFO] Applying mojo extractor for language: bsh
[INFO] Mojo extractor for language: bsh found 0 mojo descriptors.
[INFO] 
[INFO] --- maven-remote-resources-plugin:1.4:process (default) @ jena-maven-tools ---
[INFO] 
[INFO] --- maven-resources-plugin:2.6:resources (default-resources) @ jena-maven-tools ---
[INFO] Using 'UTF-8' encoding to copy filtered resources.
[INFO] skip non existing resourceDirectory <https://builds.apache.org/job/Jena_Development_Java6/org.apache.jena$jena-maven-tools/ws/src/main/resources>
[INFO] Copying 3 resources
[INFO] 
[INFO] --- maven-compiler-plugin:3.1:compile (default-compile) @ jena-maven-tools ---
[INFO] Changes detected - recompiling the module!
[INFO] Compiling 6 source files to <https://builds.apache.org/job/Jena_Development_Java6/org.apache.jena$jena-maven-tools/ws/target/classes>
[INFO] 
[INFO] --- maven-plugin-plugin:3.2:descriptor (mojo-descriptor) @ jena-maven-tools ---
[INFO] Using 'UTF-8' encoding to read mojo metadata.
[INFO] Applying mojo extractor for language: java-annotations
[INFO] Mojo extractor for language: java-annotations found 2 mojo descriptors.
[INFO] Applying mojo extractor for language: java
[INFO] Mojo extractor for language: java found 0 mojo descriptors.
[INFO] Applying mojo extractor for language: bsh
[INFO] Mojo extractor for language: bsh found 0 mojo descriptors.
[INFO] 
[INFO] --- maven-resources-plugin:2.6:testResources (default-testResources) @ jena-maven-tools
---
[INFO] Using 'UTF-8' encoding to copy filtered resources.
[INFO] Copying 2 resources
[INFO] Copying 3 resources
[INFO] 
[INFO] --- maven-compiler-plugin:3.1:testCompile (default-testCompile) @ jena-maven-tools
---
[INFO] Changes detected - recompiling the module!
[INFO] Compiling 4 source files to <https://builds.apache.org/job/Jena_Development_Java6/org.apache.jena$jena-maven-tools/ws/target/test-classes>
[INFO] 
[INFO] --- maven-surefire-plugin:2.15:test (default-test) @ jena-maven-tools ---
[INFO] Tests are skipped.
[INFO] 
[INFO] --- maven-jar-plugin:2.4:jar (default-jar) @ jena-maven-tools ---
[INFO] Building jar: <https://builds.apache.org/job/Jena_Development_Java6/org.apache.jena$jena-maven-tools/ws/target/jena-maven-tools-0.3-SNAPSHOT.jar>
[INFO] 
[INFO] --- maven-plugin-plugin:3.2:addPluginArtifactMetadata (default-addPluginArtifactMetadata)
@ jena-maven-tools ---
[INFO] 
[INFO] --- maven-site-plugin:3.2:attach-descriptor (attach-descriptor) @ jena-maven-tools
---
[INFO] 
[INFO] --- maven-javadoc-plugin:2.9.1:jar (attach-javadocs) @ jena-maven-tools ---
[INFO] 
3 warnings
[WARNING] Javadoc Warnings
[WARNING] <https://builds.apache.org/job/Jena_Development_Java6/org.apache.jena$jena-maven-tools/ws/target/generated-sources/plugin/org/openjena/tools/schemagen/HelpMojo.java>:30:
warning - @author tag has no arguments.
[WARNING] <https://builds.apache.org/job/Jena_Development_Java6/org.apache.jena$jena-maven-tools/ws/target/generated-sources/plugin/org/openjena/tools/schemagen/HelpMojo.java>:30:
warning - @version tag has no arguments.
[WARNING] <https://builds.apache.org/job/Jena_Development_Java6/org.apache.jena$jena-maven-tools/ws/src/main/java/org/openjena/tools/schemagen/SchemagenMojo.java>:73:
warning - @parameter is an unknown tag.
[INFO] Fixed Javadoc frame injection vulnerability (CVE-2013-1571) in 1 files.
[INFO] Building jar: <https://builds.apache.org/job/Jena_Development_Java6/org.apache.jena$jena-maven-tools/ws/target/jena-maven-tools-0.3-SNAPSHOT-javadoc.jar>
[INFO] 
[INFO] --- maven-invoker-plugin:1.7:install (integration-test) @ jena-maven-tools ---
[INFO] Installing /home/jenkins/jenkins-slave/workspace/Jena_Development_Java6/trunk/jena-core/pom.xml
to <https://builds.apache.org/job/Jena_Development_Java6/org.apache.jena$jena-maven-tools/ws/target/it-repo/org/apache/jena/jena-core/2.11.1-SNAPSHOT/jena-core-2.11.1-SNAPSHOT.pom>
[INFO] Installing /home/jenkins/jenkins-slave/workspace/Jena_Development_Java6/trunk/jena-core/target/jena-core-2.11.1-SNAPSHOT.jar
to <https://builds.apache.org/job/Jena_Development_Java6/org.apache.jena$jena-maven-tools/ws/target/it-repo/org/apache/jena/jena-core/2.11.1-SNAPSHOT/jena-core-2.11.1-SNAPSHOT.jar>
[INFO] Installing /home/jenkins/jenkins-slave/workspace/Jena_Development_Java6/trunk/jena-core/pom.xml
to <https://builds.apache.org/job/Jena_Development_Java6/org.apache.jena$jena-maven-tools/ws/target/it-repo/org/apache/jena/jena-core/2.11.1-SNAPSHOT/jena-core-2.11.1-SNAPSHOT.pom>
[INFO] Installing /home/jenkins/jenkins-slave/workspace/Jena_Development_Java6/trunk/jena-core/target/jena-core-2.11.1-SNAPSHOT-sources.jar
to <https://builds.apache.org/job/Jena_Development_Java6/org.apache.jena$jena-maven-tools/ws/target/it-repo/org/apache/jena/jena-core/2.11.1-SNAPSHOT/jena-core-2.11.1-SNAPSHOT-sources.jar>
[INFO] Installing /home/jenkins/jenkins-slave/workspace/Jena_Development_Java6/trunk/jena-core/target/jena-core-2.11.1-SNAPSHOT-test-sources.jar
to <https://builds.apache.org/job/Jena_Development_Java6/org.apache.jena$jena-maven-tools/ws/target/it-repo/org/apache/jena/jena-core/2.11.1-SNAPSHOT/jena-core-2.11.1-SNAPSHOT-test-sources.jar>
[INFO] Installing /home/jenkins/jenkins-slave/workspace/Jena_Development_Java6/trunk/jena-core/target/jena-core-2.11.1-SNAPSHOT-javadoc.jar
to <https://builds.apache.org/job/Jena_Development_Java6/org.apache.jena$jena-maven-tools/ws/target/it-repo/org/apache/jena/jena-core/2.11.1-SNAPSHOT/jena-core-2.11.1-SNAPSHOT-javadoc.jar>
[INFO] Installing /home/jenkins/jenkins-slave/workspace/Jena_Development_Java6/trunk/jena-core/target/jena-core-2.11.1-SNAPSHOT-tests.jar
to <https://builds.apache.org/job/Jena_Development_Java6/org.apache.jena$jena-maven-tools/ws/target/it-repo/org/apache/jena/jena-core/2.11.1-SNAPSHOT/jena-core-2.11.1-SNAPSHOT-tests.jar>
[INFO] Installing /home/jenkins/jenkins-slave/workspace/Jena_Development_Java6/trunk/jena-parent/pom.xml
to <https://builds.apache.org/job/Jena_Development_Java6/org.apache.jena$jena-maven-tools/ws/target/it-repo/org/apache/jena/jena-parent/8-SNAPSHOT/jena-parent-8-SNAPSHOT.pom>
[INFO] Installing /home/jenkins/jenkins-slave/workspace/Jena_Development_Java6/trunk/jena-iri/pom.xml
to <https://builds.apache.org/job/Jena_Development_Java6/org.apache.jena$jena-maven-tools/ws/target/it-repo/org/apache/jena/jena-iri/1.0.1-SNAPSHOT/jena-iri-1.0.1-SNAPSHOT.pom>
[INFO] Installing /home/jenkins/jenkins-slave/workspace/Jena_Development_Java6/trunk/jena-iri/target/jena-iri-1.0.1-SNAPSHOT.jar
to <https://builds.apache.org/job/Jena_Development_Java6/org.apache.jena$jena-maven-tools/ws/target/it-repo/org/apache/jena/jena-iri/1.0.1-SNAPSHOT/jena-iri-1.0.1-SNAPSHOT.jar>
[INFO] Installing /home/jenkins/jenkins-slave/workspace/Jena_Development_Java6/trunk/jena-iri/pom.xml
to <https://builds.apache.org/job/Jena_Development_Java6/org.apache.jena$jena-maven-tools/ws/target/it-repo/org/apache/jena/jena-iri/1.0.1-SNAPSHOT/jena-iri-1.0.1-SNAPSHOT.pom>
[INFO] Installing /home/jenkins/jenkins-slave/workspace/Jena_Development_Java6/trunk/jena-iri/target/jena-iri-1.0.1-SNAPSHOT-sources.jar
to <https://builds.apache.org/job/Jena_Development_Java6/org.apache.jena$jena-maven-tools/ws/target/it-repo/org/apache/jena/jena-iri/1.0.1-SNAPSHOT/jena-iri-1.0.1-SNAPSHOT-sources.jar>
[INFO] Installing /home/jenkins/jenkins-slave/workspace/Jena_Development_Java6/trunk/jena-iri/target/jena-iri-1.0.1-SNAPSHOT-javadoc.jar
to <https://builds.apache.org/job/Jena_Development_Java6/org.apache.jena$jena-maven-tools/ws/target/it-repo/org/apache/jena/jena-iri/1.0.1-SNAPSHOT/jena-iri-1.0.1-SNAPSHOT-javadoc.jar>
[INFO] Installing <https://builds.apache.org/job/Jena_Development_Java6/org.apache.jena$jena-maven-tools/ws/pom.xml>
to <https://builds.apache.org/job/Jena_Development_Java6/org.apache.jena$jena-maven-tools/ws/target/it-repo/org/apache/jena/jena-maven-tools/0.3-SNAPSHOT/jena-maven-tools-0.3-SNAPSHOT.pom>
[INFO] Installing <https://builds.apache.org/job/Jena_Development_Java6/org.apache.jena$jena-maven-tools/ws/target/jena-maven-tools-0.3-SNAPSHOT.jar>
to <https://builds.apache.org/job/Jena_Development_Java6/org.apache.jena$jena-maven-tools/ws/target/it-repo/org/apache/jena/jena-maven-tools/0.3-SNAPSHOT/jena-maven-tools-0.3-SNAPSHOT.jar>
[INFO] Installing <https://builds.apache.org/job/Jena_Development_Java6/org.apache.jena$jena-maven-tools/ws/target/jena-maven-tools-0.3-SNAPSHOT-javadoc.jar>
to <https://builds.apache.org/job/Jena_Development_Java6/org.apache.jena$jena-maven-tools/ws/target/it-repo/org/apache/jena/jena-maven-tools/0.3-SNAPSHOT/jena-maven-tools-0.3-SNAPSHOT-javadoc.jar>
[INFO] 
[INFO] --- maven-invoker-plugin:1.7:run (integration-test) @ jena-maven-tools ---
[WARNING] Filtering of parent/child POMs is not supported without cloning the projects
[INFO] Building: schemagen-integration-2/pom.xml
[INFO] run script verify.bsh
[INFO] ..FAILED (22.5 s)
[INFO]   The post-build script did not succeed. Expected file was not found: /x1/jenkins/jenkins-slave/workspace/Jena_Development_Java6/trunk/jena-maven-tools/src/it/schemagen-integration-2/target/alt-source-dir/org/example/test/Test1.java
[INFO] Building: schemagen-integration-1/pom.xml
[INFO] run script verify.bsh
[INFO] ..FAILED (3.2 s)
[INFO]   The post-build script did not succeed. Expected file was not found: /x1/jenkins/jenkins-slave/workspace/Jena_Development_Java6/trunk/jena-maven-tools/src/it/schemagen-integration-1/target/generated-sources/org/example/test/Test1.java
[INFO] Building: schemagen-integration-3/pom.xml
[INFO] run script verify.bsh
[INFO] ..FAILED (3.1 s)
[INFO]   The post-build script did not succeed. Expected file was not found: /x1/jenkins/jenkins-slave/workspace/Jena_Development_Java6/trunk/jena-maven-tools/src/it/schemagen-integration-3/target/generated-sources/org/example/test/Test1.java
[INFO] Building: schemagen-integration-0/pom.xml
[INFO] run script verify.bsh
[INFO] ..FAILED (3.2 s)
[INFO]   The post-build script did not succeed. Expected file was not found: /x1/jenkins/jenkins-slave/workspace/Jena_Development_Java6/trunk/jena-maven-tools/src/it/schemagen-integration-0/target/generated-sources/Test1.java
[INFO] -------------------------------------------------
[INFO] Build Summary:
[INFO]   Passed: 0, Failed: 4, Errors: 0, Skipped: 0
[INFO] -------------------------------------------------
[ERROR] The following builds failed:
[ERROR] *  schemagen-integration-2/pom.xml
[ERROR] *  schemagen-integration-1/pom.xml
[ERROR] *  schemagen-integration-3/pom.xml
[ERROR] *  schemagen-integration-0/pom.xml
[INFO] -------------------------------------------------

Mime
View raw message