jena-commits mailing list archives

Site index · List index
Message view « Date » · « Thread »
Top « Date » · « Thread »
From Apache Jenkins Server <jenk...@builds.apache.org>
Subject Build failed in Jenkins: Jena_Development_Deploy #503
Date Fri, 29 Nov 2013 14:38:36 GMT
See <https://builds.apache.org/job/Jena_Development_Deploy/503/changes>

Changes:

[andy] Covenice operation to create a unique file name - incremental counter guaranteed.
Format -- directory/base(???).ext where (??) is empty or "-1", "-2", ....

------------------------------------------
[...truncated 1913 lines...]
[INFO] 
[INFO] --- maven-enforcer-plugin:1.2:enforce (enforce) @ apache-jena ---
[INFO] 
[INFO] --- maven-remote-resources-plugin:1.4:process (default) @ apache-jena ---
[INFO] 
[INFO] --- maven-site-plugin:3.2:attach-descriptor (attach-descriptor) @ apache-jena ---
[INFO] 
[INFO] --- maven-assembly-plugin:2.2.1:single (create-jena-download) @ apache-jena ---
[INFO] Reading assembly descriptor: assembly-jena-zip.xml
[INFO] apache-jena-2.11.1-SNAPSHOT/src-examples/ already added, skipping
[INFO] apache-jena-2.11.1-SNAPSHOT/src-examples/ already added, skipping
[INFO] Building zip: <https://builds.apache.org/job/Jena_Development_Deploy/ws/trunk/apache-jena/target/apache-jena-2.11.1-SNAPSHOT.zip>
[INFO] apache-jena-2.11.1-SNAPSHOT/src-examples/ already added, skipping
[INFO] apache-jena-2.11.1-SNAPSHOT/src-examples/ already added, skipping
[INFO] apache-jena-2.11.1-SNAPSHOT/src-examples/ already added, skipping
[INFO] apache-jena-2.11.1-SNAPSHOT/src-examples/ already added, skipping
[INFO] Building tar : <https://builds.apache.org/job/Jena_Development_Deploy/ws/trunk/apache-jena/target/apache-jena-2.11.1-SNAPSHOT.tar.gz>
[INFO] apache-jena-2.11.1-SNAPSHOT/src-examples/ already added, skipping
[INFO] apache-jena-2.11.1-SNAPSHOT/src-examples/ already added, skipping
[INFO] 
[INFO] --- maven-install-plugin:2.3.1:install (default-install) @ apache-jena ---
[INFO] Installing <https://builds.apache.org/job/Jena_Development_Deploy/ws/trunk/apache-jena/pom.xml>
to /home/jenkins/jenkins-slave/maven-repositories/1/org/apache/jena/apache-jena/2.11.1-SNAPSHOT/apache-jena-2.11.1-SNAPSHOT.pom
[INFO] Installing <https://builds.apache.org/job/Jena_Development_Deploy/ws/trunk/apache-jena/target/apache-jena-2.11.1-SNAPSHOT.zip>
to /home/jenkins/jenkins-slave/maven-repositories/1/org/apache/jena/apache-jena/2.11.1-SNAPSHOT/apache-jena-2.11.1-SNAPSHOT.zip
[INFO] Installing <https://builds.apache.org/job/Jena_Development_Deploy/ws/trunk/apache-jena/target/apache-jena-2.11.1-SNAPSHOT.tar.gz>
to /home/jenkins/jenkins-slave/maven-repositories/1/org/apache/jena/apache-jena/2.11.1-SNAPSHOT/apache-jena-2.11.1-SNAPSHOT.tar.gz
[INFO] 
[INFO] --- maven-deploy-plugin:2.7:deploy (default-deploy) @ apache-jena ---
Downloading: https://repository.apache.org/content/repositories/snapshots/org/apache/jena/apache-jena/2.11.1-SNAPSHOT/maven-metadata.xml
Downloaded: https://repository.apache.org/content/repositories/snapshots/org/apache/jena/apache-jena/2.11.1-SNAPSHOT/maven-metadata.xml
(960 B at 3.7 KB/sec)
Uploading: https://repository.apache.org/content/repositories/snapshots/org/apache/jena/apache-jena/2.11.1-SNAPSHOT/apache-jena-2.11.1-20131129.143335-44.pom
Uploaded: https://repository.apache.org/content/repositories/snapshots/org/apache/jena/apache-jena/2.11.1-SNAPSHOT/apache-jena-2.11.1-20131129.143335-44.pom
(7 KB at 60.6 KB/sec)
Downloading: https://repository.apache.org/content/repositories/snapshots/org/apache/jena/apache-jena/maven-metadata.xml
Downloaded: https://repository.apache.org/content/repositories/snapshots/org/apache/jena/apache-jena/maven-metadata.xml
(348 B at 3.1 KB/sec)
Uploading: https://repository.apache.org/content/repositories/snapshots/org/apache/jena/apache-jena/2.11.1-SNAPSHOT/maven-metadata.xml
Uploaded: https://repository.apache.org/content/repositories/snapshots/org/apache/jena/apache-jena/2.11.1-SNAPSHOT/maven-metadata.xml
(960 B at 8.4 KB/sec)
Uploading: https://repository.apache.org/content/repositories/snapshots/org/apache/jena/apache-jena/maven-metadata.xml
Uploaded: https://repository.apache.org/content/repositories/snapshots/org/apache/jena/apache-jena/maven-metadata.xml
(348 B at 3.3 KB/sec)
Uploading: https://repository.apache.org/content/repositories/snapshots/org/apache/jena/apache-jena/2.11.1-SNAPSHOT/apache-jena-2.11.1-20131129.143335-44.zip
Uploaded: https://repository.apache.org/content/repositories/snapshots/org/apache/jena/apache-jena/2.11.1-SNAPSHOT/apache-jena-2.11.1-20131129.143335-44.zip
(24571 KB at 18363.7 KB/sec)
Uploading: https://repository.apache.org/content/repositories/snapshots/org/apache/jena/apache-jena/2.11.1-SNAPSHOT/maven-metadata.xml
Uploaded: https://repository.apache.org/content/repositories/snapshots/org/apache/jena/apache-jena/2.11.1-SNAPSHOT/maven-metadata.xml
(960 B at 13.6 KB/sec)
Uploading: https://repository.apache.org/content/repositories/snapshots/org/apache/jena/apache-jena/2.11.1-SNAPSHOT/apache-jena-2.11.1-20131129.143335-44.tar.gz
Uploaded: https://repository.apache.org/content/repositories/snapshots/org/apache/jena/apache-jena/2.11.1-SNAPSHOT/apache-jena-2.11.1-20131129.143335-44.tar.gz
(16553 KB at 18853.0 KB/sec)
Uploading: https://repository.apache.org/content/repositories/snapshots/org/apache/jena/apache-jena/2.11.1-SNAPSHOT/maven-metadata.xml
Uploaded: https://repository.apache.org/content/repositories/snapshots/org/apache/jena/apache-jena/2.11.1-SNAPSHOT/maven-metadata.xml
(960 B at 15.9 KB/sec)
[INFO]                                                                         
[INFO] ------------------------------------------------------------------------
[INFO] Building Jena plugins for Apache Maven,including schemagen 0.3-SNAPSHOT
[INFO] ------------------------------------------------------------------------
[INFO] 
[INFO] --- maven-clean-plugin:2.5:clean (default-clean) @ jena-maven-tools ---
[INFO] 
[INFO] --- maven-enforcer-plugin:1.2:enforce (enforce) @ jena-maven-tools ---
[INFO] 
[INFO] --- maven-plugin-plugin:3.2:helpmojo (help-goal) @ jena-maven-tools ---
[INFO] Using 'UTF-8' encoding to read mojo metadata.
[INFO] Applying mojo extractor for language: java-annotations
[INFO] Mojo extractor for language: java-annotations found 0 mojo descriptors.
[INFO] Applying mojo extractor for language: java
[INFO] Mojo extractor for language: java found 0 mojo descriptors.
[INFO] Applying mojo extractor for language: bsh
[INFO] Mojo extractor for language: bsh found 0 mojo descriptors.
[INFO] 
[INFO] --- maven-plugin-plugin:3.2:descriptor (default-descriptor) @ jena-maven-tools ---
[INFO] Using 'UTF-8' encoding to read mojo metadata.
[INFO] Applying mojo extractor for language: java-annotations
[INFO] Mojo extractor for language: java-annotations found 0 mojo descriptors.
[INFO] Applying mojo extractor for language: java
[INFO] Mojo extractor for language: java found 0 mojo descriptors.
[INFO] Applying mojo extractor for language: bsh
[INFO] Mojo extractor for language: bsh found 0 mojo descriptors.
[INFO] 
[INFO] --- maven-remote-resources-plugin:1.4:process (default) @ jena-maven-tools ---
[INFO] 
[INFO] --- maven-resources-plugin:2.6:resources (default-resources) @ jena-maven-tools ---
[INFO] Using 'UTF-8' encoding to copy filtered resources.
[INFO] skip non existing resourceDirectory <https://builds.apache.org/job/Jena_Development_Deploy/ws/trunk/jena-maven-tools/src/main/resources>
[INFO] Copying 3 resources
[INFO] 
[INFO] --- maven-compiler-plugin:3.1:compile (default-compile) @ jena-maven-tools ---
[INFO] Changes detected - recompiling the module!
[INFO] Compiling 6 source files to <https://builds.apache.org/job/Jena_Development_Deploy/ws/trunk/jena-maven-tools/target/classes>
[INFO] 
[INFO] --- maven-plugin-plugin:3.2:descriptor (mojo-descriptor) @ jena-maven-tools ---
[INFO] Using 'UTF-8' encoding to read mojo metadata.
[INFO] Applying mojo extractor for language: java-annotations
[INFO] Mojo extractor for language: java-annotations found 2 mojo descriptors.
[INFO] Applying mojo extractor for language: java
[INFO] Mojo extractor for language: java found 0 mojo descriptors.
[INFO] Applying mojo extractor for language: bsh
[INFO] Mojo extractor for language: bsh found 0 mojo descriptors.
[INFO] 
[INFO] --- maven-resources-plugin:2.6:testResources (default-testResources) @ jena-maven-tools
---
[INFO] Using 'UTF-8' encoding to copy filtered resources.
[INFO] Copying 2 resources
[INFO] Copying 3 resources
[INFO] 
[INFO] --- maven-compiler-plugin:3.1:testCompile (default-testCompile) @ jena-maven-tools
---
[INFO] Changes detected - recompiling the module!
[INFO] Compiling 4 source files to <https://builds.apache.org/job/Jena_Development_Deploy/ws/trunk/jena-maven-tools/target/test-classes>
[INFO] 
[INFO] --- maven-surefire-plugin:2.15:test (default-test) @ jena-maven-tools ---
[INFO] Surefire report directory: <https://builds.apache.org/job/Jena_Development_Deploy/ws/trunk/jena-maven-tools/target/surefire-reports>

-------------------------------------------------------
 T E S T S
-------------------------------------------------------
Running org.openjena.tools.schemagen.SchemagenOptionsTest
log4j:WARN No appenders could be found for logger (com.hp.hpl.jena.util.FileManager).
log4j:WARN Please initialize the log4j system properly.
log4j:WARN See http://logging.apache.org/log4j/1.2/faq.html#noconfig for more info.
Tests run: 31, Failures: 0, Errors: 0, Skipped: 0, Time elapsed: 0.472 sec - in org.openjena.tools.schemagen.SchemagenOptionsTest
Running org.openjena.tools.schemagen.SourceTest
Tests run: 3, Failures: 0, Errors: 0, Skipped: 1, Time elapsed: 0.015 sec - in org.openjena.tools.schemagen.SourceTest
Running org.openjena.tools.schemagen.SchemagenMojoTest
Tests run: 4, Failures: 0, Errors: 0, Skipped: 0, Time elapsed: 0.458 sec - in org.openjena.tools.schemagen.SchemagenMojoTest
Running org.openjena.tools.schemagen.SourceParameterTest
Tests run: 37, Failures: 0, Errors: 0, Skipped: 0, Time elapsed: 0.213 sec - in org.openjena.tools.schemagen.SourceParameterTest

Results :

Tests run: 75, Failures: 0, Errors: 0, Skipped: 1

[JENKINS] Recording test results
[INFO] 
[INFO] --- maven-jar-plugin:2.4:jar (default-jar) @ jena-maven-tools ---
[INFO] Building jar: <https://builds.apache.org/job/Jena_Development_Deploy/ws/trunk/jena-maven-tools/target/jena-maven-tools-0.3-SNAPSHOT.jar>
[INFO] 
[INFO] --- maven-plugin-plugin:3.2:addPluginArtifactMetadata (default-addPluginArtifactMetadata)
@ jena-maven-tools ---
[INFO] 
[INFO] --- maven-site-plugin:3.2:attach-descriptor (attach-descriptor) @ jena-maven-tools
---
[INFO] 
[INFO] --- maven-javadoc-plugin:2.9.1:jar (attach-javadocs) @ jena-maven-tools ---
[INFO] 
3 warnings
[WARNING] Javadoc Warnings
[WARNING] <https://builds.apache.org/job/Jena_Development_Deploy/ws/trunk/jena-maven-tools/target/generated-sources/plugin/org/openjena/tools/schemagen/HelpMojo.java>:30:
warning - @author tag has no arguments.
[WARNING] <https://builds.apache.org/job/Jena_Development_Deploy/ws/trunk/jena-maven-tools/target/generated-sources/plugin/org/openjena/tools/schemagen/HelpMojo.java>:30:
warning - @version tag has no arguments.
[WARNING] <https://builds.apache.org/job/Jena_Development_Deploy/ws/trunk/jena-maven-tools/src/main/java/org/openjena/tools/schemagen/SchemagenMojo.java>:73:
warning - @parameter is an unknown tag.
[INFO] Building jar: <https://builds.apache.org/job/Jena_Development_Deploy/ws/trunk/jena-maven-tools/target/jena-maven-tools-0.3-SNAPSHOT-javadoc.jar>
[INFO] 
[INFO] --- maven-invoker-plugin:1.7:install (integration-test) @ jena-maven-tools ---
[INFO] Installing <https://builds.apache.org/job/Jena_Development_Deploy/ws/trunk/jena-core/pom.xml>
to <https://builds.apache.org/job/Jena_Development_Deploy/ws/trunk/jena-maven-tools/target/it-repo/org/apache/jena/jena-core/2.11.1-SNAPSHOT/jena-core-2.11.1-SNAPSHOT.pom>
[INFO] Installing <https://builds.apache.org/job/Jena_Development_Deploy/ws/trunk/jena-core/target/jena-core-2.11.1-SNAPSHOT.jar>
to <https://builds.apache.org/job/Jena_Development_Deploy/ws/trunk/jena-maven-tools/target/it-repo/org/apache/jena/jena-core/2.11.1-SNAPSHOT/jena-core-2.11.1-SNAPSHOT.jar>
[INFO] Installing <https://builds.apache.org/job/Jena_Development_Deploy/ws/trunk/jena-core/pom.xml>
to <https://builds.apache.org/job/Jena_Development_Deploy/ws/trunk/jena-maven-tools/target/it-repo/org/apache/jena/jena-core/2.11.1-SNAPSHOT/jena-core-2.11.1-SNAPSHOT.pom>
[INFO] Installing <https://builds.apache.org/job/Jena_Development_Deploy/ws/trunk/jena-core/target/jena-core-2.11.1-SNAPSHOT-sources.jar>
to <https://builds.apache.org/job/Jena_Development_Deploy/ws/trunk/jena-maven-tools/target/it-repo/org/apache/jena/jena-core/2.11.1-SNAPSHOT/jena-core-2.11.1-SNAPSHOT-sources.jar>
[INFO] Installing <https://builds.apache.org/job/Jena_Development_Deploy/ws/trunk/jena-core/target/jena-core-2.11.1-SNAPSHOT-test-sources.jar>
to <https://builds.apache.org/job/Jena_Development_Deploy/ws/trunk/jena-maven-tools/target/it-repo/org/apache/jena/jena-core/2.11.1-SNAPSHOT/jena-core-2.11.1-SNAPSHOT-test-sources.jar>
[INFO] Installing <https://builds.apache.org/job/Jena_Development_Deploy/ws/trunk/jena-core/target/jena-core-2.11.1-SNAPSHOT-javadoc.jar>
to <https://builds.apache.org/job/Jena_Development_Deploy/ws/trunk/jena-maven-tools/target/it-repo/org/apache/jena/jena-core/2.11.1-SNAPSHOT/jena-core-2.11.1-SNAPSHOT-javadoc.jar>
[INFO] Installing <https://builds.apache.org/job/Jena_Development_Deploy/ws/trunk/jena-core/target/jena-core-2.11.1-SNAPSHOT-tests.jar>
to <https://builds.apache.org/job/Jena_Development_Deploy/ws/trunk/jena-maven-tools/target/it-repo/org/apache/jena/jena-core/2.11.1-SNAPSHOT/jena-core-2.11.1-SNAPSHOT-tests.jar>
[INFO] Installing <https://builds.apache.org/job/Jena_Development_Deploy/ws/trunk/jena-parent/pom.xml>
to <https://builds.apache.org/job/Jena_Development_Deploy/ws/trunk/jena-maven-tools/target/it-repo/org/apache/jena/jena-parent/8-SNAPSHOT/jena-parent-8-SNAPSHOT.pom>
[INFO] Installing <https://builds.apache.org/job/Jena_Development_Deploy/ws/trunk/jena-iri/pom.xml>
to <https://builds.apache.org/job/Jena_Development_Deploy/ws/trunk/jena-maven-tools/target/it-repo/org/apache/jena/jena-iri/1.0.1-SNAPSHOT/jena-iri-1.0.1-SNAPSHOT.pom>
[INFO] Installing <https://builds.apache.org/job/Jena_Development_Deploy/ws/trunk/jena-iri/target/jena-iri-1.0.1-SNAPSHOT.jar>
to <https://builds.apache.org/job/Jena_Development_Deploy/ws/trunk/jena-maven-tools/target/it-repo/org/apache/jena/jena-iri/1.0.1-SNAPSHOT/jena-iri-1.0.1-SNAPSHOT.jar>
[INFO] Installing <https://builds.apache.org/job/Jena_Development_Deploy/ws/trunk/jena-iri/pom.xml>
to <https://builds.apache.org/job/Jena_Development_Deploy/ws/trunk/jena-maven-tools/target/it-repo/org/apache/jena/jena-iri/1.0.1-SNAPSHOT/jena-iri-1.0.1-SNAPSHOT.pom>
[INFO] Installing <https://builds.apache.org/job/Jena_Development_Deploy/ws/trunk/jena-iri/target/jena-iri-1.0.1-SNAPSHOT-sources.jar>
to <https://builds.apache.org/job/Jena_Development_Deploy/ws/trunk/jena-maven-tools/target/it-repo/org/apache/jena/jena-iri/1.0.1-SNAPSHOT/jena-iri-1.0.1-SNAPSHOT-sources.jar>
[INFO] Installing <https://builds.apache.org/job/Jena_Development_Deploy/ws/trunk/jena-iri/target/jena-iri-1.0.1-SNAPSHOT-javadoc.jar>
to <https://builds.apache.org/job/Jena_Development_Deploy/ws/trunk/jena-maven-tools/target/it-repo/org/apache/jena/jena-iri/1.0.1-SNAPSHOT/jena-iri-1.0.1-SNAPSHOT-javadoc.jar>
[INFO] Installing <https://builds.apache.org/job/Jena_Development_Deploy/ws/trunk/jena-maven-tools/pom.xml>
to <https://builds.apache.org/job/Jena_Development_Deploy/ws/trunk/jena-maven-tools/target/it-repo/org/apache/jena/jena-maven-tools/0.3-SNAPSHOT/jena-maven-tools-0.3-SNAPSHOT.pom>
[INFO] Installing <https://builds.apache.org/job/Jena_Development_Deploy/ws/trunk/jena-maven-tools/target/jena-maven-tools-0.3-SNAPSHOT.jar>
to <https://builds.apache.org/job/Jena_Development_Deploy/ws/trunk/jena-maven-tools/target/it-repo/org/apache/jena/jena-maven-tools/0.3-SNAPSHOT/jena-maven-tools-0.3-SNAPSHOT.jar>
[INFO] Installing <https://builds.apache.org/job/Jena_Development_Deploy/ws/trunk/jena-maven-tools/target/jena-maven-tools-0.3-SNAPSHOT-javadoc.jar>
to <https://builds.apache.org/job/Jena_Development_Deploy/ws/trunk/jena-maven-tools/target/it-repo/org/apache/jena/jena-maven-tools/0.3-SNAPSHOT/jena-maven-tools-0.3-SNAPSHOT-javadoc.jar>
[INFO] 
[INFO] --- maven-invoker-plugin:1.7:run (integration-test) @ jena-maven-tools ---
[WARNING] Filtering of parent/child POMs is not supported without cloning the projects
[INFO] Building: schemagen-integration-2/pom.xml
[INFO] run script verify.bsh
[INFO] ..FAILED (12.8 s)
[INFO]   The post-build script did not succeed. Expected file was not found: /x1/jenkins/jenkins-slave/workspace/Jena_Development_Deploy/trunk/jena-maven-tools/src/it/schemagen-integration-2/target/alt-source-dir/org/example/test/Test1.java
[INFO] Building: schemagen-integration-1/pom.xml
[INFO] run script verify.bsh
[INFO] ..FAILED (2.9 s)
[INFO]   The post-build script did not succeed. Expected file was not found: /x1/jenkins/jenkins-slave/workspace/Jena_Development_Deploy/trunk/jena-maven-tools/src/it/schemagen-integration-1/target/generated-sources/org/example/test/Test1.java
[INFO] Building: schemagen-integration-3/pom.xml
[INFO] run script verify.bsh
[INFO] ..FAILED (3.0 s)
[INFO]   The post-build script did not succeed. Expected file was not found: /x1/jenkins/jenkins-slave/workspace/Jena_Development_Deploy/trunk/jena-maven-tools/src/it/schemagen-integration-3/target/generated-sources/org/example/test/Test1.java
[INFO] Building: schemagen-integration-0/pom.xml
[INFO] run script verify.bsh
[INFO] ..FAILED (3.1 s)
[INFO]   The post-build script did not succeed. Expected file was not found: /x1/jenkins/jenkins-slave/workspace/Jena_Development_Deploy/trunk/jena-maven-tools/src/it/schemagen-integration-0/target/generated-sources/Test1.java
[INFO] -------------------------------------------------
[INFO] Build Summary:
[INFO]   Passed: 0, Failed: 4, Errors: 0, Skipped: 0
[INFO] -------------------------------------------------
[ERROR] The following builds failed:
[ERROR] *  schemagen-integration-2/pom.xml
[ERROR] *  schemagen-integration-1/pom.xml
[ERROR] *  schemagen-integration-3/pom.xml
[ERROR] *  schemagen-integration-0/pom.xml
[INFO] -------------------------------------------------
[INFO] ------------------------------------------------------------------------
[INFO] Reactor Summary:
[INFO] 
[INFO] Apache Jena - Parent .............................. SUCCESS [14.341s]
[INFO] Apache Jena - IRI ................................. SUCCESS [19.212s]
[INFO] Apache Jena - Core ................................ SUCCESS [1:14.045s]
[INFO] Apache Jena - ARQ (SPARQL 1.1 Query Engine) ....... SUCCESS [1:14.440s]
[INFO] Apache Jena - TDB (Native Triple Store) ........... SUCCESS [20.701s]
[INFO] Apache Jena - Libraries POM ....................... SUCCESS [5.469s]
[INFO] Apache Jena - SPARQL Text Search .................. SUCCESS [14.600s]
[INFO] Apache Jena - SPARQL Spatial Search ............... SUCCESS [10.926s]
[INFO] Apache Jena - SDB (SQL based triple store) ........ SUCCESS [43.101s]
[INFO] Apache Jena - Fuseki (SPARQL 1.1 Server) .......... SUCCESS [29.468s]
[INFO] Apache Jena - Security ............................ SUCCESS [20.924s]
[INFO] Apache Jena - JDBC Parent ......................... SUCCESS [10.706s]
[INFO] Apache Jena - JDBC Core API ....................... SUCCESS [37.909s]
[INFO] Apache Jena - JDBC Remote Endpoint Driver ......... SUCCESS [32.151s]
[INFO] Apache Jena - JDBC In-Memory Driver ............... SUCCESS [16.004s]
[INFO] Apache Jena - JDBC TDB Driver ..................... SUCCESS [33.208s]
[INFO] Apache Jena - JDBC Driver Bundle .................. SUCCESS [14.987s]
[INFO] Apache Jena - Distribution ........................ SUCCESS [26.677s]
[INFO] Jena plugins for Apache Maven,including schemagen . FAILURE [29.454s]
[INFO] Apache Jena ....................................... SKIPPED
[INFO] ------------------------------------------------------------------------
[INFO] BUILD FAILURE
[INFO] ------------------------------------------------------------------------
[INFO] Total time: 16:13.895s
[INFO] Finished at: Fri Nov 29 14:34:25 UTC 2013
[INFO] Final Memory: 95M/483M
[INFO] ------------------------------------------------------------------------
[JENKINS] Archiving disabled
[JENKINS] Archiving disabled
[JENKINS] Archiving disabled
[JENKINS] Archiving disabled
[JENKINS] Archiving disabled
[JENKINS] Archiving disabled
[JENKINS] Archiving disabled
[JENKINS] Archiving disabled
[JENKINS] Archiving disabled
[JENKINS] Archiving disabled
[JENKINS] Archiving disabled
[JENKINS] Archiving disabled
[JENKINS] Archiving disabled
[JENKINS] Archiving disabled
[JENKINS] Archiving disabled
[JENKINS] Archiving disabled
[JENKINS] Archiving disabled
[JENKINS] Archiving disabled
[JENKINS] Archiving disabled
[JENKINS] Archiving disabled
Waiting for Jenkins to finish collecting data
[ERROR] Failed to execute goal org.apache.maven.plugins:maven-invoker-plugin:1.7:run (integration-test)
on project jena-maven-tools: 4 builds failed. See console output above for details. ->
[Help 1]
[ERROR] 
[ERROR] To see the full stack trace of the errors, re-run Maven with the -e switch.
[ERROR] Re-run Maven using the -X switch to enable full debug logging.
[ERROR] 
[ERROR] For more information about the errors and possible solutions, please read the following
articles:
[ERROR] [Help 1] http://cwiki.apache.org/confluence/display/MAVEN/MojoFailureException
[ERROR] 
[ERROR] After correcting the problems, you can resume the build with the command
[ERROR]   mvn <goals> -rf :jena-maven-tools
Sending e-mails to: commits@jena.apache.org null@apache.org
channel stopped

Mime
View raw message