jena-commits mailing list archives

Site index · List index
Message view « Date » · « Thread »
Top « Date » · « Thread »
From Apache Jenkins Server <jenk...@builds.apache.org>
Subject Build failed in Jenkins: Jena_Development_Test » Apache Jena - SDB (SQL based triple store) #959
Date Sun, 22 Sep 2013 09:43:09 GMT
See <https://builds.apache.org/job/Jena_Development_Test/org.apache.jena$jena-sdb/959/>

------------------------------------------
Sep 22, 2013 9:41:38 AM org.apache.maven.cli.event.ExecutionEventLogger projectStarted
INFO:                                                                         
Sep 22, 2013 9:41:38 AM org.apache.maven.cli.event.ExecutionEventLogger projectStarted
INFO: ------------------------------------------------------------------------
Sep 22, 2013 9:41:38 AM org.apache.maven.cli.event.ExecutionEventLogger projectStarted
INFO: Building Apache Jena - SDB (SQL based triple store) 1.4.1-SNAPSHOT
Sep 22, 2013 9:41:38 AM org.apache.maven.cli.event.ExecutionEventLogger projectStarted
INFO: ------------------------------------------------------------------------
Sep 22, 2013 9:41:39 AM org.apache.maven.cli.event.ExecutionEventLogger mojoStarted
INFO: 
Sep 22, 2013 9:41:39 AM org.apache.maven.cli.event.ExecutionEventLogger mojoStarted
INFO: --- maven-clean-plugin:2.5:clean (default-clean) @ jena-sdb ---
Sep 22, 2013 9:41:39 AM org.apache.maven.cli.event.ExecutionEventLogger mojoStarted
INFO: 
Sep 22, 2013 9:41:39 AM org.apache.maven.cli.event.ExecutionEventLogger mojoStarted
INFO: --- maven-enforcer-plugin:1.2:enforce (enforce) @ jena-sdb ---
Sep 22, 2013 9:41:39 AM org.apache.maven.cli.event.ExecutionEventLogger mojoStarted
INFO: 
Sep 22, 2013 9:41:39 AM org.apache.maven.cli.event.ExecutionEventLogger mojoStarted
INFO: --- maven-remote-resources-plugin:1.4:process (default) @ jena-sdb ---
Sep 22, 2013 9:41:39 AM org.apache.maven.cli.event.ExecutionEventLogger mojoStarted
INFO: 
Sep 22, 2013 9:41:39 AM org.apache.maven.cli.event.ExecutionEventLogger mojoStarted
INFO: --- maven-resources-plugin:2.5:resources (default-resources) @ jena-sdb ---
[debug] execute contextualize
[INFO] Using 'UTF-8' encoding to copy filtered resources.
[INFO] Copying 1 resource to com/hp/hpl/jena/sdb/
[INFO] Copying 3 resources
Sep 22, 2013 9:41:40 AM org.apache.maven.cli.event.ExecutionEventLogger mojoStarted
INFO: 
Sep 22, 2013 9:41:40 AM org.apache.maven.cli.event.ExecutionEventLogger mojoStarted
INFO: --- maven-compiler-plugin:2.3.2:compile (default-compile) @ jena-sdb ---
[INFO] Compiling 348 source files to <https://builds.apache.org/job/Jena_Development_Test/org.apache.jena$jena-sdb/ws/target/classes>
[INFO] -------------------------------------------------------------
[ERROR] COMPILATION ERROR : 
[INFO] -------------------------------------------------------------
[ERROR] <https://builds.apache.org/job/Jena_Development_Test/org.apache.jena$jena-sdb/ws/src/main/java/sdb/sdbprint.java>:[51,26]
cannot find symbol
symbol  : constructor ModQueryIn()
location: class arq.cmdline.ModQueryIn
[ERROR] <https://builds.apache.org/job/Jena_Development_Test/org.apache.jena$jena-sdb/ws/src/main/java/sdb/sdbquery.java>:[63,32]
cannot find symbol
symbol  : constructor ModQueryIn()
location: class arq.cmdline.ModQueryIn
[INFO] 2 errors 
[INFO] -------------------------------------------------------------

Mime
View raw message