jena-commits mailing list archives

Site index · List index
Message view « Date » · « Thread »
Top « Date » · « Thread »
From Apache Jenkins Server <jenk...@builds.apache.org>
Subject Build failed in Jenkins: Jena_Development_Deploy #451
Date Fri, 13 Sep 2013 07:59:31 GMT
See <https://builds.apache.org/job/Jena_Development_Deploy/451/changes>

Changes:

[andy] main

[andy] JENA-553 : tidy up running on Windows (part II)

[andy] JENA-553 : tidy up running on Windows.

[andy] Fix javadoc

------------------------------------------
[...truncated 398 lines...]
[INFO] Copying 1 resource
[INFO] Copying 3 resources
[INFO] Copying 3 resources
Sep 13, 2013 7:57:06 AM org.apache.maven.cli.event.ExecutionEventLogger mojoStarted
INFO: 
Sep 13, 2013 7:57:06 AM org.apache.maven.cli.event.ExecutionEventLogger mojoStarted
INFO: --- maven-compiler-plugin:3.1:compile (default-compile) @ jena-arq ---
[INFO] Changes detected - recompiling the module!
[INFO] Compiling 1444 source files to <https://builds.apache.org/job/Jena_Development_Deploy/ws/trunk/jena-arq/target/classes>
[WARNING] <https://builds.apache.org/job/Jena_Development_Deploy/ws/trunk/jena-arq/src/main/java/org/apache/jena/riot/system/IRIResolver.java>:
Some input files use or override a deprecated API.
[WARNING] <https://builds.apache.org/job/Jena_Development_Deploy/ws/trunk/jena-arq/src/main/java/org/apache/jena/riot/system/IRIResolver.java>:
Recompile with -Xlint:deprecation for details.
[WARNING] <https://builds.apache.org/job/Jena_Development_Deploy/ws/trunk/jena-arq/src/main/java/com/hp/hpl/jena/sparql/engine/http/QueryEngineHTTP.java>:
<https://builds.apache.org/job/Jena_Development_Deploy/ws/trunk/jena-arq/src/main/java/com/hp/hpl/jena/sparql/engine/http/QueryEngineHTTP.java>
uses unchecked or unsafe operations.
[WARNING] <https://builds.apache.org/job/Jena_Development_Deploy/ws/trunk/jena-arq/src/main/java/com/hp/hpl/jena/sparql/engine/http/QueryEngineHTTP.java>:
Recompile with -Xlint:unchecked for details.
Sep 13, 2013 7:57:35 AM org.apache.maven.cli.event.ExecutionEventLogger mojoStarted
INFO: 
Sep 13, 2013 7:57:35 AM org.apache.maven.cli.event.ExecutionEventLogger mojoStarted
INFO: --- maven-resources-plugin:2.6:testResources (default-testResources) @ jena-arq ---
[INFO] Using 'UTF-8' encoding to copy filtered resources.
[INFO] Copying 2 resources
[INFO] Copying 3 resources
Sep 13, 2013 7:57:35 AM org.apache.maven.cli.event.ExecutionEventLogger mojoStarted
INFO: 
Sep 13, 2013 7:57:35 AM org.apache.maven.cli.event.ExecutionEventLogger mojoStarted
INFO: --- maven-compiler-plugin:3.1:testCompile (default-testCompile) @ jena-arq ---
[INFO] Changes detected - recompiling the module!
[INFO] Compiling 273 source files to <https://builds.apache.org/job/Jena_Development_Deploy/ws/trunk/jena-arq/target/test-classes>
Sep 13, 2013 7:57:47 AM org.apache.maven.cli.event.ExecutionEventLogger mojoStarted
INFO: 
Sep 13, 2013 7:57:47 AM org.apache.maven.cli.event.ExecutionEventLogger mojoStarted
INFO: --- maven-surefire-plugin:2.15:test (default-test) @ jena-arq ---
[INFO] Surefire report directory: <https://builds.apache.org/job/Jena_Development_Deploy/ws/trunk/jena-arq/target/surefire-reports>

-------------------------------------------------------
 T E S T S
-------------------------------------------------------
Running org.apache.jena.common.TS_Common
Tests run: 28, Failures: 0, Errors: 0, Skipped: 0, Time elapsed: 0.933 sec - in org.apache.jena.common.TS_Common
Running org.apache.jena.web.TS_Web
Tests run: 8, Failures: 0, Errors: 0, Skipped: 0, Time elapsed: 0 sec - in org.apache.jena.web.TS_Web
Running org.apache.jena.atlas.io.TS_IO
Tests run: 112, Failures: 0, Errors: 0, Skipped: 0, Time elapsed: 0.085 sec - in org.apache.jena.atlas.io.TS_IO
Running org.apache.jena.atlas.data.TS_Data
Tests run: 12, Failures: 0, Errors: 0, Skipped: 0, Time elapsed: 1.561 sec - in org.apache.jena.atlas.data.TS_Data
Running org.apache.jena.atlas.web.TS_Web
Tests run: 17, Failures: 0, Errors: 0, Skipped: 0, Time elapsed: 0.008 sec - in org.apache.jena.atlas.web.TS_Web
Running org.apache.jena.atlas.iterator.TS_Iterator
Tests run: 73, Failures: 0, Errors: 0, Skipped: 0, Time elapsed: 0.032 sec - in org.apache.jena.atlas.iterator.TS_Iterator
Running org.apache.jena.atlas.event.TS_Event
Tests run: 3, Failures: 0, Errors: 0, Skipped: 0, Time elapsed: 0.002 sec - in org.apache.jena.atlas.event.TS_Event
Running org.apache.jena.atlas.lib.TS_Lib
Tests run: 349, Failures: 1, Errors: 0, Skipped: 0, Time elapsed: 0.772 sec <<< FAILURE!
- in org.apache.jena.atlas.lib.TS_Lib
alarm_03(org.apache.jena.atlas.lib.TestAlarmClock)  Time elapsed: 0.105 sec  <<<
FAILURE!
java.lang.AssertionError: expected:<1> but was:<0>
	at org.junit.Assert.fail(Assert.java:88)
	at org.junit.Assert.failNotEquals(Assert.java:743)
	at org.junit.Assert.assertEquals(Assert.java:118)
	at org.junit.Assert.assertEquals(Assert.java:555)
	at org.junit.Assert.assertEquals(Assert.java:542)
	at org.apache.jena.atlas.lib.TestAlarmClock.alarm_03(TestAlarmClock.java:68)

Running org.apache.jena.atlas.json.TS_JSON
Tests run: 27, Failures: 0, Errors: 0, Skipped: 0, Time elapsed: 0.022 sec - in org.apache.jena.atlas.json.TS_JSON
Running org.apache.jena.riot.adapters.TS_RIOTAdapters
Tests run: 13, Failures: 0, Errors: 0, Skipped: 0, Time elapsed: 0.079 sec - in org.apache.jena.riot.adapters.TS_RIOTAdapters
Running org.apache.jena.riot.system.TS_RiotSystem
Tests run: 157, Failures: 0, Errors: 0, Skipped: 0, Time elapsed: 0.197 sec - in org.apache.jena.riot.system.TS_RiotSystem
Running org.apache.jena.riot.process.TS_Process
Tests run: 60, Failures: 0, Errors: 0, Skipped: 0, Time elapsed: 0.025 sec - in org.apache.jena.riot.process.TS_Process
Running org.apache.jena.riot.out.TS_Out
Tests run: 90, Failures: 0, Errors: 0, Skipped: 0, Time elapsed: 0.029 sec - in org.apache.jena.riot.out.TS_Out
Running org.apache.jena.riot.lang.TS_Lang
Tests run: 401, Failures: 0, Errors: 0, Skipped: 0, Time elapsed: 3.717 sec - in org.apache.jena.riot.lang.TS_Lang
Running org.apache.jena.riot.stream.TS_IO2
Tests run: 40, Failures: 0, Errors: 0, Skipped: 0, Time elapsed: 0.059 sec - in org.apache.jena.riot.stream.TS_IO2
Running org.apache.jena.riot.web.TS_RiotWeb
Tests run: 19, Failures: 0, Errors: 0, Skipped: 0, Time elapsed: 0.007 sec - in org.apache.jena.riot.web.TS_RiotWeb
Running org.apache.jena.riot.TS_LangSuite
Tests run: 369, Failures: 0, Errors: 0, Skipped: 0, Time elapsed: 3.421 sec - in org.apache.jena.riot.TS_LangSuite
Running org.apache.jena.riot.tokens.TS_Tokens
Tests run: 129, Failures: 0, Errors: 0, Skipped: 0, Time elapsed: 0.021 sec - in org.apache.jena.riot.tokens.TS_Tokens
Running org.apache.jena.riot.writer.TS_RiotWriter
Tests run: 442, Failures: 0, Errors: 0, Skipped: 0, Time elapsed: 0.88 sec - in org.apache.jena.riot.writer.TS_RiotWriter
Running org.apache.jena.riot.TS_ReaderRIOT
Tests run: 129, Failures: 0, Errors: 0, Skipped: 0, Time elapsed: 0.185 sec - in org.apache.jena.riot.TS_ReaderRIOT
Running arq.TS_Cmd
Tests run: 7, Failures: 0, Errors: 0, Skipped: 0, Time elapsed: 0.002 sec - in arq.TS_Cmd
Running com.hp.hpl.jena.sparql.modify.TS_Update
Tests run: 67, Failures: 0, Errors: 0, Skipped: 0, Time elapsed: 0.209 sec - in com.hp.hpl.jena.sparql.modify.TS_Update
Running com.hp.hpl.jena.sparql.resultset.TS_ResultSet
Tests run: 130, Failures: 0, Errors: 0, Skipped: 0, Time elapsed: 0.168 sec - in com.hp.hpl.jena.sparql.resultset.TS_ResultSet
Running com.hp.hpl.jena.sparql.syntax.TS_Serialization
Tests run: 42, Failures: 0, Errors: 0, Skipped: 0, Time elapsed: 0.076 sec - in com.hp.hpl.jena.sparql.syntax.TS_Serialization
Running com.hp.hpl.jena.sparql.syntax.TS_SSE
Tests run: 127, Failures: 0, Errors: 0, Skipped: 0, Time elapsed: 0.037 sec - in com.hp.hpl.jena.sparql.syntax.TS_SSE
Running com.hp.hpl.jena.sparql.engine.TS_Engine
Tests run: 40, Failures: 0, Errors: 0, Skipped: 0, Time elapsed: 8.965 sec - in com.hp.hpl.jena.sparql.engine.TS_Engine
Running com.hp.hpl.jena.sparql.engine.binding.TS_Binding
Tests run: 16, Failures: 0, Errors: 0, Skipped: 0, Time elapsed: 0.005 sec - in com.hp.hpl.jena.sparql.engine.binding.TS_Binding
Running com.hp.hpl.jena.sparql.graph.TS_Graph
Tests run: 63, Failures: 0, Errors: 0, Skipped: 0, Time elapsed: 0.059 sec - in com.hp.hpl.jena.sparql.graph.TS_Graph
Running com.hp.hpl.jena.sparql.lang.TS_Lang
Tests run: 55, Failures: 0, Errors: 0, Skipped: 0, Time elapsed: 0.023 sec - in com.hp.hpl.jena.sparql.lang.TS_Lang
Running com.hp.hpl.jena.sparql.transaction.TS_Transaction
Tests run: 23, Failures: 0, Errors: 0, Skipped: 0, Time elapsed: 0.008 sec - in com.hp.hpl.jena.sparql.transaction.TS_Transaction
Running com.hp.hpl.jena.sparql.expr.TS_Expr
Tests run: 1069, Failures: 0, Errors: 0, Skipped: 0, Time elapsed: 0.36 sec - in com.hp.hpl.jena.sparql.expr.TS_Expr
Running com.hp.hpl.jena.sparql.util.TS_Util
Tests run: 76, Failures: 0, Errors: 0, Skipped: 0, Time elapsed: 0.055 sec - in com.hp.hpl.jena.sparql.util.TS_Util
Running com.hp.hpl.jena.sparql.api.TS_API
Tests run: 41, Failures: 0, Errors: 0, Skipped: 0, Time elapsed: 2.779 sec - in com.hp.hpl.jena.sparql.api.TS_API
Running com.hp.hpl.jena.sparql.core.TS_Core
Tests run: 91, Failures: 0, Errors: 0, Skipped: 0, Time elapsed: 3.55 sec - in com.hp.hpl.jena.sparql.core.TS_Core
Running com.hp.hpl.jena.sparql.TC_DAWG
Tests run: 467, Failures: 0, Errors: 0, Skipped: 0, Time elapsed: 2.296 sec - in com.hp.hpl.jena.sparql.TC_DAWG
Running com.hp.hpl.jena.sparql.function.user.TS_UserFunctions
Tests run: 22, Failures: 0, Errors: 0, Skipped: 0, Time elapsed: 0.004 sec - in com.hp.hpl.jena.sparql.function.user.TS_UserFunctions
Running com.hp.hpl.jena.sparql.algebra.TS_Algebra
Tests run: 276, Failures: 0, Errors: 0, Skipped: 0, Time elapsed: 1.051 sec - in com.hp.hpl.jena.sparql.algebra.TS_Algebra
Running com.hp.hpl.jena.sparql.path.TS_Path
Tests run: 107, Failures: 0, Errors: 0, Skipped: 0, Time elapsed: 0.339 sec - in com.hp.hpl.jena.sparql.path.TS_Path
Running com.hp.hpl.jena.sparql.TC_Scripted
Tests run: 994, Failures: 0, Errors: 0, Skipped: 0, Time elapsed: 4.503 sec - in com.hp.hpl.jena.sparql.TC_Scripted
Running com.hp.hpl.jena.sparql.solver.TS_Solver
Tests run: 23, Failures: 0, Errors: 0, Skipped: 0, Time elapsed: 0 sec - in com.hp.hpl.jena.sparql.solver.TS_Solver
Running com.hp.hpl.jena.query.TS_ParamString
Tests run: 140, Failures: 0, Errors: 0, Skipped: 0, Time elapsed: 0.037 sec - in com.hp.hpl.jena.query.TS_ParamString

Results :

Failed tests: 
  TestAlarmClock.alarm_03:68->Assert.assertEquals:542->Assert.assertEquals:555->Assert.assertEquals:118->Assert.failNotEquals:743->Assert.fail:88
expected:<1> but was:<0>

Tests run: 6354, Failures: 1, Errors: 0, Skipped: 0

[ERROR] There are test failures.

Please refer to <https://builds.apache.org/job/Jena_Development_Deploy/ws/trunk/jena-arq/target/surefire-reports>
for the individual test results.
[JENKINS] Recording test results
Sep 13, 2013 7:58:29 AM org.apache.maven.cli.event.ExecutionEventLogger mojoStarted
INFO: 
Sep 13, 2013 7:58:29 AM org.apache.maven.cli.event.ExecutionEventLogger mojoStarted
INFO: --- maven-jar-plugin:2.4:jar (default-jar) @ jena-arq ---
[INFO] Building jar: <https://builds.apache.org/job/Jena_Development_Deploy/ws/trunk/jena-arq/target/jena-arq-2.11.1-SNAPSHOT.jar>
Sep 13, 2013 7:58:30 AM org.apache.maven.cli.event.ExecutionEventLogger mojoStarted
INFO: 
Sep 13, 2013 7:58:30 AM org.apache.maven.cli.event.ExecutionEventLogger mojoStarted
INFO: --- maven-site-plugin:3.2:attach-descriptor (attach-descriptor) @ jena-arq ---
Sep 13, 2013 7:58:30 AM org.apache.maven.cli.event.ExecutionEventLogger mojoStarted
INFO: 
Sep 13, 2013 7:58:30 AM org.apache.maven.cli.event.ExecutionEventLogger mojoStarted
INFO: --- maven-source-plugin:2.2.1:jar-no-fork (attach-sources) @ jena-arq ---
[INFO] Building jar: <https://builds.apache.org/job/Jena_Development_Deploy/ws/trunk/jena-arq/target/jena-arq-2.11.1-SNAPSHOT-sources.jar>
Sep 13, 2013 7:58:33 AM org.apache.maven.cli.event.ExecutionEventLogger mojoStarted
INFO: 
Sep 13, 2013 7:58:33 AM org.apache.maven.cli.event.ExecutionEventLogger mojoStarted
INFO: --- maven-source-plugin:2.2.1:test-jar-no-fork (attach-sources-test) @ jena-arq ---
[INFO] Building jar: <https://builds.apache.org/job/Jena_Development_Deploy/ws/trunk/jena-arq/target/jena-arq-2.11.1-SNAPSHOT-test-sources.jar>
Sep 13, 2013 7:58:34 AM org.apache.maven.cli.event.ExecutionEventLogger mojoStarted
INFO: 
Sep 13, 2013 7:58:34 AM org.apache.maven.cli.event.ExecutionEventLogger mojoStarted
INFO: --- maven-jar-plugin:2.4:test-jar (default) @ jena-arq ---
[INFO] Building jar: <https://builds.apache.org/job/Jena_Development_Deploy/ws/trunk/jena-arq/target/jena-arq-2.11.1-SNAPSHOT-tests.jar>
Sep 13, 2013 7:58:35 AM org.apache.maven.cli.event.ExecutionEventLogger mojoStarted
INFO: 
Sep 13, 2013 7:58:35 AM org.apache.maven.cli.event.ExecutionEventLogger mojoStarted
INFO: --- maven-javadoc-plugin:2.9.1:jar (attach-javadocs) @ jena-arq ---
[INFO] Building jar: <https://builds.apache.org/job/Jena_Development_Deploy/ws/trunk/jena-arq/target/jena-arq-2.11.1-SNAPSHOT-javadoc.jar>
Sep 13, 2013 7:59:08 AM org.apache.maven.cli.event.ExecutionEventLogger logReactorSummary
INFO: ------------------------------------------------------------------------
Sep 13, 2013 7:59:08 AM org.apache.maven.cli.event.ExecutionEventLogger logReactorSummary
INFO: Reactor Summary:
Sep 13, 2013 7:59:08 AM org.apache.maven.cli.event.ExecutionEventLogger logReactorSummary
INFO: 
Sep 13, 2013 7:59:08 AM org.apache.maven.cli.event.ExecutionEventLogger logReactorSummary
INFO: Apache Jena - Parent .............................. SUCCESS [25.766s]
Sep 13, 2013 7:59:08 AM org.apache.maven.cli.event.ExecutionEventLogger logReactorSummary
INFO: Apache Jena - IRI ................................. SUCCESS [25.377s]
Sep 13, 2013 7:59:08 AM org.apache.maven.cli.event.ExecutionEventLogger logReactorSummary
INFO: Apache Jena - Core ................................ SUCCESS [1:20.501s]
Sep 13, 2013 7:59:08 AM org.apache.maven.cli.event.ExecutionEventLogger logReactorSummary
INFO: Apache Jena - ARQ (SPARQL 1.1 Query Engine) ....... FAILURE [2:04.108s]
Sep 13, 2013 7:59:08 AM org.apache.maven.cli.event.ExecutionEventLogger logReactorSummary
INFO: Apache Jena - TDB (Native Triple Store) ........... SKIPPED
Sep 13, 2013 7:59:08 AM org.apache.maven.cli.event.ExecutionEventLogger logReactorSummary
INFO: Apache Jena - Libraries POM ....................... SKIPPED
Sep 13, 2013 7:59:08 AM org.apache.maven.cli.event.ExecutionEventLogger logReactorSummary
INFO: Apache Jena - SPARQL Text Search .................. SKIPPED
Sep 13, 2013 7:59:08 AM org.apache.maven.cli.event.ExecutionEventLogger logReactorSummary
INFO: Apache Jena - SPARQL Spatial Search ............... SKIPPED
Sep 13, 2013 7:59:08 AM org.apache.maven.cli.event.ExecutionEventLogger logReactorSummary
INFO: Apache Jena - SDB (SQL based triple store) ........ SKIPPED
Sep 13, 2013 7:59:08 AM org.apache.maven.cli.event.ExecutionEventLogger logReactorSummary
INFO: Apache Jena - Fuseki (SPARQL 1.1 Server) .......... SKIPPED
Sep 13, 2013 7:59:08 AM org.apache.maven.cli.event.ExecutionEventLogger logReactorSummary
INFO: Apache Jena - Security ............................ SKIPPED
Sep 13, 2013 7:59:08 AM org.apache.maven.cli.event.ExecutionEventLogger logReactorSummary
INFO: Apache Jena - JDBC Parent ......................... SKIPPED
Sep 13, 2013 7:59:08 AM org.apache.maven.cli.event.ExecutionEventLogger logReactorSummary
INFO: Apache Jena - JDBC Core API ....................... SKIPPED
Sep 13, 2013 7:59:08 AM org.apache.maven.cli.event.ExecutionEventLogger logReactorSummary
INFO: Apache Jena - JDBC Remote Endpoint Driver ......... SKIPPED
Sep 13, 2013 7:59:08 AM org.apache.maven.cli.event.ExecutionEventLogger logReactorSummary
INFO: Apache Jena - JDBC In-Memory Driver ............... SKIPPED
Sep 13, 2013 7:59:08 AM org.apache.maven.cli.event.ExecutionEventLogger logReactorSummary
INFO: Apache Jena - JDBC TDB Driver ..................... SKIPPED
Sep 13, 2013 7:59:08 AM org.apache.maven.cli.event.ExecutionEventLogger logReactorSummary
INFO: Apache Jena - JDBC Driver Bundle .................. SKIPPED
Sep 13, 2013 7:59:08 AM org.apache.maven.cli.event.ExecutionEventLogger logReactorSummary
INFO: Apache Jena - Distribution ........................ SKIPPED
Sep 13, 2013 7:59:08 AM org.apache.maven.cli.event.ExecutionEventLogger logReactorSummary
INFO: Apache Jena ....................................... SKIPPED
Sep 13, 2013 7:59:08 AM org.apache.maven.cli.event.ExecutionEventLogger logResult
INFO: ------------------------------------------------------------------------
Sep 13, 2013 7:59:08 AM org.apache.maven.cli.event.ExecutionEventLogger logResult
INFO: BUILD FAILURE
Sep 13, 2013 7:59:08 AM org.apache.maven.cli.event.ExecutionEventLogger logStats
INFO: ------------------------------------------------------------------------
Sep 13, 2013 7:59:08 AM org.apache.maven.cli.event.ExecutionEventLogger logStats
INFO: Total time: 4:18.301s
Sep 13, 2013 7:59:08 AM org.apache.maven.cli.event.ExecutionEventLogger logStats
INFO: Finished at: Fri Sep 13 07:59:08 UTC 2013
Sep 13, 2013 7:59:08 AM org.apache.maven.cli.event.ExecutionEventLogger logStats
INFO: Final Memory: 41M/327M
Sep 13, 2013 7:59:08 AM org.apache.maven.cli.event.ExecutionEventLogger sessionEnded
INFO: ------------------------------------------------------------------------
[JENKINS] Archiving disabled
[JENKINS] Archiving disabled
[JENKINS] Archiving disabled
[JENKINS] Archiving disabled
[JENKINS] Archiving disabled
[JENKINS] Archiving disabled
[JENKINS] Archiving disabled
[JENKINS] Archiving disabled
[JENKINS] Archiving disabled
[JENKINS] Archiving disabled
[JENKINS] Archiving disabled
[JENKINS] Archiving disabled
[JENKINS] Archiving disabled
[JENKINS] Archiving disabled
[JENKINS] Archiving disabled
[JENKINS] Archiving disabled
[JENKINS] Archiving disabled
[JENKINS] Archiving disabled
[JENKINS] Archiving disabled
Waiting for Jenkins to finish collecting data
Maven failed with error.
Sending e-mails to: commits@jena.apache.org
Sending e-mails to: commits@jena.apache.org
channel stopped

Mime
View raw message