jena-commits mailing list archives

Site index · List index
Message view « Date » · « Thread »
Top « Date » · « Thread »
From Apache Jenkins Server <jenk...@builds.apache.org>
Subject Build failed in Jenkins: Jena_Development_Test_Windows #198
Date Sun, 08 Sep 2013 10:13:53 GMT
See <https://builds.apache.org/job/Jena_Development_Test_Windows/198/changes>

Changes:

[jpz6311whu] move the created files of the tests to target/..., so that the source code tree
is not modified by the tests.

[andy] Switch off file logging

[andy] Remove duplicate dependency

[andy] Use connection caching in testing

[andy] Reenable jena-jdbc

[andy] Temporary :: Don't build JDBC - this hangs Jenkins sometimes currently

[andy] Version headings

[andy] Main build is a complete build; dev profile for development use

[andy] Make name style like other modules

[andy] Include jena-sdb in the binary distribution.

[andy] Release preparation:

Remove embedded solr so that server-side of Solr is not a dependency.
  Exception in assembler if "embedded:" used.

Remove warnings from the code base and add some @Override's
Remove throws declarations of unthrown exceptions.

Remove JTS from the POM, even optional, so as not to risk inclusion in the build.

[andy] Release preparation

[andy] Tidying up : release 2.11.0 preparation

[andy] Add manuipulating log level error.

[andy] JENA-503

------------------------------------------
[...truncated 11453 lines...]
AU        jena-tdb\bin\tdbloader2worker
AU        jena-tdb\bin\tdbupdate
AU        jena-tdb\bin\tdbclean
AU        jena-tdb\bin\tdbloader2
AU        jena-tdb\bin\tdbloader3
AU        jena-tdb\bin\tdb_path
AU        jena-tdb\log4j.properties
AU        jena-tdb\pom.xml
AU        jena-tdb\tdb.ttl
A         jena-tdb\resources2
AU        jena-tdb\resources2\log4j.properties
A         jena-tdb\README
A         jena-tdb\testing
A         jena-tdb\testing\Values
AU        jena-tdb\testing\Values\manifest.ttl
AU        jena-tdb\testing\Values\data-1.ttl
A         jena-tdb\testing\Values\value-00.rq
A         jena-tdb\testing\Values\value-01.rq
A         jena-tdb\testing\Values\value-02.rq
A         jena-tdb\testing\Values\value-03.rq
A         jena-tdb\testing\Values\value-04.rq
A         jena-tdb\testing\Values\value-05.rq
A         jena-tdb\testing\Values\value-06.rq
A         jena-tdb\testing\Values\value-07.rq
A         jena-tdb\testing\Values\value-08.rq
A         jena-tdb\testing\Values\value-09.rq
A         jena-tdb\testing\Basic
A         jena-tdb\testing\Basic\basic-1-O.rq
A         jena-tdb\testing\Basic\basic-1-P.rq
A         jena-tdb\testing\Basic\basic-3-O.rq
A         jena-tdb\testing\Basic\basic-1-SPO.rq
A         jena-tdb\testing\Basic\basic-3-P.rq
A         jena-tdb\testing\Basic\basic-1-S.rq
A         jena-tdb\testing\Basic\basic-3-S.rq
AU        jena-tdb\testing\Basic\manifest.ttl
AU        jena-tdb\testing\Basic\data-1.ttl
A         jena-tdb\testing\Basic\basic-1-PO.rq
A         jena-tdb\testing\Basic\basic-3-PO.rq
A         jena-tdb\testing\Basic\basic-00.rq
A         jena-tdb\testing\Basic\basic-1-SO.rq
A         jena-tdb\testing\Basic\basic-1-SP.rq
A         jena-tdb\testing\Basic\basic-2-SO.rq
A         jena-tdb\testing\Basic\basic-3-SO.rq
A         jena-tdb\testing\Basic\basic-3-SP.rq
A         jena-tdb\testing\Update
A         jena-tdb\testing\Update\update-1.ru
A         jena-tdb\testing\Update\create-1.ru
A         jena-tdb\testing\Update\update-2.ru
A         jena-tdb\testing\Update\drop-1.ru
A         jena-tdb\testing\Update\update-3.ru
A         jena-tdb\testing\Loader
A         jena-tdb\testing\Loader\data-1.nq
A         jena-tdb\testing\Loader\data-2.nt
A         jena-tdb\testing\Loader\data-4.ttl
A         jena-tdb\testing\Loader\data-3.trig
AU        jena-tdb\testing\Notes.txt
A         jena-tdb\testing\loader1.nt
AU        jena-tdb\testing\manifest.ttl
AU        jena-tdb\testing\turtle-tests-2008-14.zip
A         jena-tdb\testing\UnionGraph
A         jena-tdb\testing\UnionGraph\merge-4.rq
A         jena-tdb\testing\UnionGraph\merge-5.rq
A         jena-tdb\testing\UnionGraph\merge-6.rq
AU        jena-tdb\testing\UnionGraph\data-dft.ttl
A         jena-tdb\testing\UnionGraph\merge-A-results.srx
A         jena-tdb\testing\UnionGraph\merge-B-results.srx
A         jena-tdb\testing\UnionGraph\merge-A.rq
A         jena-tdb\testing\UnionGraph\merge-B.rq
A         jena-tdb\testing\UnionGraph\merge-1-results.srx
AU        jena-tdb\testing\UnionGraph\manifest.ttl
A         jena-tdb\testing\UnionGraph\merge-2-results.srx
AU        jena-tdb\testing\UnionGraph\data-1.ttl
A         jena-tdb\testing\UnionGraph\merge-3-results.srx
AU        jena-tdb\testing\UnionGraph\data-2.ttl
A         jena-tdb\testing\UnionGraph\merge-4-results.srx
A         jena-tdb\testing\UnionGraph\merge-5-results.srx
A         jena-tdb\testing\UnionGraph\merge-6-results.srx
A         jena-tdb\testing\UnionGraph\merge-1.rq
A         jena-tdb\testing\UnionGraph\merge-2.rq
A         jena-tdb\testing\UnionGraph\merge-3.rq
AU        jena-tdb\testing\data.ttl
A         jena-tdb\testing\Assembler
AU        jena-tdb\testing\Assembler\tdb-graph.ttl
AU        jena-tdb\testing\Assembler\tdb-named-graph-1.ttl
AU        jena-tdb\testing\Assembler\tdb-named-graph-2.ttl
AU        jena-tdb\testing\Assembler\tdb-dataset.ttl
AU        jena-tdb\testing\Assembler\tdb-graph-embed.ttl
AU        jena-tdb\testing\Assembler\tdb-graph-ref-dataset.ttl
AU        jena-tdb\testing\Assembler\tdb-dataset-embed.ttl
A         jena-tdb\testing\Pattern
AU        jena-tdb\testing\Pattern\manifest.ttl
AU        jena-tdb\testing\Pattern\data-1.ttl
A         jena-tdb\testing\Pattern\pattern-1.rq
A         jena-tdb\testing\Pattern\pattern-2.rq
A         jena-tdb\testing\Quads
AU        jena-tdb\testing\Quads\data-dft.ttl
AU        jena-tdb\testing\Quads\manifest.ttl
AU        jena-tdb\testing\Quads\data-1.ttl
A         jena-tdb\testing\Quads\quad-01.rq
AU        jena-tdb\testing\Quads\data-2.ttl
A         jena-tdb\testing\Quads\quad-02.rq
A         jena-tdb\NOTICE
A         jena-examples
A         jena-examples\src
A         jena-examples\src\main
A         jena-examples\src\main\resources
A         jena-examples\src\main\resources\ontologies
A         jena-examples\src\main\resources\ontologies\cheese.ttl
A         jena-examples\src\main\resources\data
A         jena-examples\src\main\resources\data\cheeses-0.1.ttl
A         jena-examples\src\main\resources\data\pizza.owl.rdf
A         jena-examples\src\main\java
A         jena-examples\src\main\java\org
A         jena-examples\src\main\java\org\apache
A         jena-examples\src\main\java\org\apache\jena
A         jena-examples\src\main\java\org\apache\jena\example
AU        jena-examples\src\main\java\org\apache\jena\example\CheeseBase.java
AU        jena-examples\src\main\java\org\apache\jena\example\Base.java
A         jena-examples\src\main\java\org\apache\jena\example\helloworld
AU        jena-examples\src\main\java\org\apache\jena\example\helloworld\HelloWorld.java
A         jena-examples\src\main\java\org\apache\jena\example\pizza
AU        jena-examples\src\main\java\org\apache\jena\example\pizza\PizzaSparqlNoInf.java
A         jena-examples\src\test
A         jena-examples\src\test\java
A         jena-examples\src\test\java\org
A         jena-examples\src\test\java\org\apache
A         jena-examples\src\test\java\org\apache\jena_examples
AU        jena-examples\src\test\java\org\apache\jena_examples\AppTest.java
A         jena-examples\bin
A         jena-examples\bin\get-data
AU        jena-examples\pom.xml
A         jena-examples\README.md
A         pom.xml
A         apache-jena
AU        apache-jena\cmd-maker
A         apache-jena\template.bat
A         apache-jena\NOTICE
A         apache-jena\LICENSE
A         apache-jena\template.bin
A         apache-jena\jena-log4j.properties
A         apache-jena\DEPENDENCIES
A         apache-jena\bat
A         apache-jena\bat\turtle.bat
A         apache-jena\bat\juuid.bat
A         apache-jena\bat\update.bat
A         apache-jena\bat\rdfcompare.bat
A         apache-jena\bat\arq.bat
A         apache-jena\bat\iri.bat
A         apache-jena\bat\rsparql.bat
A         apache-jena\bat\utf8.bat
A         apache-jena\bat\tdbstats.bat
A         apache-jena\bat\schemagen.bat
A         apache-jena\bat\nquads.bat
A         apache-jena\bat\qparse.bat
A         apache-jena\bat\rdfxml.bat
A         apache-jena\bat\tdbquery.bat
A         apache-jena\bat\tdbdump.bat
A         apache-jena\bat\tdbbackup.bat
A         apache-jena\bat\uparse.bat
A         apache-jena\bat\ntriples.bat
A         apache-jena\bat\tdbloader.bat
A         apache-jena\bat\wwwdec.bat
A         apache-jena\bat\sparql.bat
A         apache-jena\bat\rdfcat.bat
A         apache-jena\bat\infer.bat
A         apache-jena\bat\rupdate.bat
A         apache-jena\bat\trig.bat
A         apache-jena\bat\rdfparse.bat
A         apache-jena\bat\rdfcopy.bat
A         apache-jena\bat\wwwenc.bat
A         apache-jena\bat\tdbupdate.bat
A         apache-jena\bat\rset.bat
A         apache-jena\bat\riot.bat
A         apache-jena\bin
AU        apache-jena\bin\juuid
AU        apache-jena\bin\tdbloader2
AU        apache-jena\bin\rdfcompare
AU        apache-jena\bin\rsparql
AU        apache-jena\bin\schemagen
AU        apache-jena\bin\tdbbackup
AU        apache-jena\bin\tdbquery
AU        apache-jena\bin\tdbloader
AU        apache-jena\bin\ntriples
AU        apache-jena\bin\rdfcat
AU        apache-jena\bin\infer
AU        apache-jena\bin\trig
AU        apache-jena\bin\rdfparse
AU        apache-jena\bin\wwwenc
AU        apache-jena\bin\tdbloader2worker
AU        apache-jena\bin\rset
AU        apache-jena\bin\riot
AU        apache-jena\bin\turtle
AU        apache-jena\bin\update
AU        apache-jena\bin\arq
AU        apache-jena\bin\iri
AU        apache-jena\bin\utf8
AU        apache-jena\bin\tdbstats
AU        apache-jena\bin\qparse
AU        apache-jena\bin\nquads
AU        apache-jena\bin\rdfxml
AU        apache-jena\bin\uparse
AU        apache-jena\bin\tdbdump
AU        apache-jena\bin\wwwdec
AU        apache-jena\bin\sparql
AU        apache-jena\bin\rupdate
AU        apache-jena\bin\rdfcopy
AU        apache-jena\bin\tdbupdate
A         apache-jena\assembly-jena-zip.xml
A         apache-jena\pom.xml
A         apache-jena\README
A         README
 U        .
At revision 1520850
Parsing POMs
ERROR: Failed to parse POMs
hudson.util.IOException2: remote file operation failed: <https://builds.apache.org/job/Jena_Development_Test_Windows/ws/trunk>
at hudson.remoting.Channel@5dfd6a9b:windows1
	at hudson.FilePath.act(FilePath.java:905)
	at hudson.FilePath.act(FilePath.java:882)
	at hudson.maven.MavenModuleSetBuild$MavenModuleSetBuildExecution.parsePoms(MavenModuleSetBuild.java:920)
	at hudson.maven.MavenModuleSetBuild$MavenModuleSetBuildExecution.doRun(MavenModuleSetBuild.java:652)
	at hudson.model.AbstractBuild$AbstractBuildExecution.run(AbstractBuild.java:567)
	at hudson.model.Run.execute(Run.java:1603)
	at hudson.maven.MavenModuleSetBuild.run(MavenModuleSetBuild.java:506)
	at hudson.model.ResourceController.execute(ResourceController.java:88)
	at hudson.model.Executor.run(Executor.java:246)
Caused by: hudson.remoting.ProxyException: hudson.maven.MavenModuleSetBuild$MavenExecutionException:
org.apache.maven.project.ProjectBuildingException: Some problems were encountered while processing
the POMs:
[FATAL] Non-resolvable parent POM: Could not find artifact org.apache.jena:jena-parent:pom:7-SNAPSHOT
and 'parent.relativePath' points at no local POM @ line 27, column 11

	at hudson.maven.MavenModuleSetBuild$PomParser.invoke(MavenModuleSetBuild.java:1323)
	at hudson.maven.MavenModuleSetBuild$PomParser.invoke(MavenModuleSetBuild.java:1058)
	at hudson.FilePath$FileCallableWrapper.call(FilePath.java:2423)
	at hudson.remoting.UserRequest.perform(UserRequest.java:118)
	at hudson.remoting.UserRequest.perform(UserRequest.java:48)
	at hudson.remoting.Request$2.run(Request.java:326)
	at hudson.remoting.InterceptingExecutorService$1.call(InterceptingExecutorService.java:72)
	at java.util.concurrent.FutureTask$Sync.innerRun(Unknown Source)
	at java.util.concurrent.FutureTask.run(Unknown Source)
	at java.util.concurrent.ThreadPoolExecutor.runWorker(Unknown Source)
	at java.util.concurrent.ThreadPoolExecutor$Worker.run(Unknown Source)
	at hudson.remoting.Engine$1$1.run(Engine.java:63)
	at java.lang.Thread.run(Unknown Source)
Caused by: hudson.remoting.ProxyException: org.apache.maven.project.ProjectBuildingException:
Some problems were encountered while processing the POMs:
[FATAL] Non-resolvable parent POM: Could not find artifact org.apache.jena:jena-parent:pom:7-SNAPSHOT
and 'parent.relativePath' points at no local POM @ line 27, column 11

	at org.apache.maven.project.DefaultProjectBuilder.build(DefaultProjectBuilder.java:364)
	at hudson.maven.MavenEmbedder.buildProjects(MavenEmbedder.java:361)
	at hudson.maven.MavenEmbedder.readProjects(MavenEmbedder.java:331)
	at hudson.maven.MavenModuleSetBuild$PomParser.invoke(MavenModuleSetBuild.java:1260)
	... 12 more

Mime
View raw message