jena-commits mailing list archives

Site index · List index
Message view « Date » · « Thread »
Top « Date » · « Thread »
From Apache Jenkins Server <jenk...@builds.apache.org>
Subject Build failed in Jenkins: Jena__Development_Test » Apache Jena - TDB (Native Triple Store) #741
Date Sun, 30 Jun 2013 10:37:05 GMT
See <https://builds.apache.org/job/Jena__Development_Test/org.apache.jena$jena-tdb/741/>

------------------------------------------
[INFO]                                                                         
[INFO] ------------------------------------------------------------------------
[INFO] Building Apache Jena - TDB (Native Triple Store) 0.10.2-SNAPSHOT
[INFO] ------------------------------------------------------------------------
[INFO] 
[INFO] --- maven-clean-plugin:2.4.1:clean (default-clean) @ jena-tdb ---
[INFO] 
[INFO] --- maven-enforcer-plugin:1.2:enforce (enforce) @ jena-tdb ---
[INFO] 
[INFO] --- maven-remote-resources-plugin:1.2.1:process (default) @ jena-tdb ---
[INFO] [INFO] Using 'UTF-8' encoding to copy filtered resources.
[INFO] Copying 0 resource
[INFO] Copying 1 resource

[INFO] --- maven-resources-plugin:2.6:resources (default-resources) @ jena-tdb ---
[INFO] Copying 3 resources
[INFO] 
[INFO] --- maven-compiler-plugin:2.5.1:compile (default-compile) @ jena-tdb ---
[INFO] Compiling 261 source files to <https://builds.apache.org/job/Jena__Development_Test/org.apache.jena$jena-tdb/ws/target/classes>
[INFO] [INFO] Using 'UTF-8' encoding to copy filtered resources.
[INFO] Copying 0 resource
[INFO] Copying 3 resources

[INFO] --- maven-resources-plugin:2.6:testResources (default-testResources) @ jena-tdb ---
[INFO] 
[INFO] --- maven-compiler-plugin:2.5.1:testCompile (default-testCompile) @ jena-tdb ---
[INFO] Compiling 132 source files to <https://builds.apache.org/job/Jena__Development_Test/org.apache.jena$jena-tdb/ws/target/test-classes>
[INFO] -------------------------------------------------------------
[ERROR] COMPILATION ERROR : 
[INFO] -------------------------------------------------------------
[ERROR] <https://builds.apache.org/job/Jena__Development_Test/org.apache.jena$jena-tdb/ws/src/test/java/com/hp/hpl/jena/tdb/graph/TestDatasetGraphAccessorTDB.java>:[22,26]
cannot find symbol
symbol  : class TestDatasetGraphAccessorBase
location: package org.apache.jena.web
[ERROR] <https://builds.apache.org/job/Jena__Development_Test/org.apache.jena$jena-tdb/ws/src/test/java/com/hp/hpl/jena/tdb/graph/TestDatasetGraphAccessorTDB.java>:[28,49]
cannot find symbol
symbol: class TestDatasetGraphAccessorBase
public class TestDatasetGraphAccessorTDB extends TestDatasetGraphAccessorBase
[ERROR] <https://builds.apache.org/job/Jena__Development_Test/org.apache.jena$jena-tdb/ws/src/test/java/com/hp/hpl/jena/tdb/graph/TestDatasetGraphAccessorTDB.java>:[30,4]
method does not override or implement a method from a supertype
[INFO] 3 errors 
[INFO] -------------------------------------------------------------

Mime
View raw message