jena-commits mailing list archives

Site index · List index
Message view « Date » · « Thread »
Top « Date » · « Thread »
From Apache Jenkins Server <jenk...@builds.apache.org>
Subject Build failed in Jenkins: Jena__Development_Test » Apache Jena - SPARQL and Lucene/Solr #708
Date Sun, 23 Jun 2013 16:28:46 GMT
See <https://builds.apache.org/job/Jena__Development_Test/org.apache.jena$jena-text/708/changes>

Changes:

[andy] Development tool - dump the index, given an assembler file.

[andy] Clean code, remove debug printing.

------------------------------------------
[INFO]                                                                         
[INFO] ------------------------------------------------------------------------
[INFO] Building Apache Jena - SPARQL and Lucene/Solr 1.0.0-SNAPSHOT
[INFO] ------------------------------------------------------------------------
[INFO] 
[INFO] --- maven-clean-plugin:2.4.1:clean (default-clean) @ jena-text ---
[INFO] 
[INFO] --- maven-enforcer-plugin:1.2:enforce (enforce) @ jena-text ---
[INFO] 
[INFO] --- maven-remote-resources-plugin:1.2.1:process (default) @ jena-text ---
[INFO] [INFO] Using 'UTF-8' encoding to copy filtered resources.
[INFO] Copying 1 resource
[INFO] Copying 2 resources
[INFO] Copying 3 resources

[INFO] --- maven-resources-plugin:2.6:resources (default-resources) @ jena-text ---
[INFO] 
[INFO] --- maven-compiler-plugin:2.5.1:compile (default-compile) @ jena-text ---
[INFO] Compiling 23 source files to <https://builds.apache.org/job/Jena__Development_Test/org.apache.jena$jena-text/ws/target/classes>
[INFO] -------------------------------------------------------------
[ERROR] COMPILATION ERROR : 
[INFO] -------------------------------------------------------------
[ERROR] <https://builds.apache.org/job/Jena__Development_Test/org.apache.jena$jena-text/ws/src/main/java/jena/textindexdump.java>:[102,43]
cannot find symbol
symbol  : method getDirectory()
location: class org.apache.jena.query.text.TextIndexLucene
[ERROR] <https://builds.apache.org/job/Jena__Development_Test/org.apache.jena$jena-text/ws/src/main/java/jena/textindexdump.java>:[103,41]
cannot find symbol
symbol  : method getAnalyzer()
location: class org.apache.jena.query.text.TextIndexLucene
[ERROR] <https://builds.apache.org/job/Jena__Development_Test/org.apache.jena$jena-text/ws/src/main/java/jena/textindexdump.java>:[106,69]
VER has private access in org.apache.jena.query.text.TextIndexLucene
[INFO] 3 errors 
[INFO] -------------------------------------------------------------

Mime
View raw message