jena-commits mailing list archives

Site index · List index
Message view « Date » · « Thread »
Top « Date » · « Thread »
From Apache Jenkins Server <jenk...@builds.apache.org>
Subject Build failed in Jenkins: Jena__Development_Test_ARM #6
Date Tue, 07 May 2013 04:06:43 GMT
See <https://builds.apache.org/job/Jena__Development_Test_ARM/6/>

------------------------------------------
Started by an SCM change
Started by an SCM change
Started by an SCM change
Started by an SCM change
Started by an SCM change
Started by an SCM change
Started by an SCM change
Started by an SCM change
Started by an SCM change
Started by an SCM change
Started by an SCM change
Started by an SCM change
Started by an SCM change
Started by an SCM change
Building remotely on ubuntu_ARM_16 in workspace <https://builds.apache.org/job/Jena__Development_Test_ARM/ws/>
hudson.util.IOException2: Failed to install http://archive.apache.org/dist/maven/binaries/apache-maven-3.0.4-bin.zip
to /home/hudson/tools/maven/apache-maven-3.0.4
	at hudson.FilePath.installIfNecessaryFrom(FilePath.java:742)
	at hudson.tools.DownloadFromUrlInstaller.performInstallation(DownloadFromUrlInstaller.java:72)
	at hudson.tools.InstallerTranslator.getToolHome(InstallerTranslator.java:61)
	at hudson.tools.ToolLocationNodeProperty.getToolHome(ToolLocationNodeProperty.java:107)
	at hudson.tools.ToolInstallation.translateFor(ToolInstallation.java:203)
	at hudson.tasks.Maven$MavenInstallation.forNode(Maven.java:595)
	at hudson.maven.MavenModuleSetBuild.getEnvironment(MavenModuleSetBuild.java:171)
	at hudson.scm.SubversionSCM.checkout(SubversionSCM.java:682)
	at hudson.model.AbstractProject.checkout(AbstractProject.java:1331)
	at hudson.model.AbstractBuild$AbstractBuildExecution.defaultCheckout(AbstractBuild.java:682)
	at jenkins.scm.SCMCheckoutStrategy.checkout(SCMCheckoutStrategy.java:88)
	at hudson.model.AbstractBuild$AbstractBuildExecution.run(AbstractBuild.java:587)
	at hudson.model.Run.execute(Run.java:1568)
	at hudson.maven.MavenModuleSetBuild.run(MavenModuleSetBuild.java:477)
	at hudson.model.ResourceController.execute(ResourceController.java:88)
	at hudson.model.Executor.run(Executor.java:236)
Caused by: java.io.IOException: Failed to mkdirs: /home/hudson/tools/maven/apache-maven-3.0.4
	at hudson.FilePath.mkdirs(FilePath.java:990)
	at hudson.FilePath.installIfNecessaryFrom(FilePath.java:721)
	... 15 more
Retrying after 10 seconds
hudson.util.IOException2: Failed to install http://archive.apache.org/dist/maven/binaries/apache-maven-3.0.4-bin.zip
to /home/hudson/tools/maven/apache-maven-3.0.4
	at hudson.FilePath.installIfNecessaryFrom(FilePath.java:742)
	at hudson.tools.DownloadFromUrlInstaller.performInstallation(DownloadFromUrlInstaller.java:72)
	at hudson.tools.InstallerTranslator.getToolHome(InstallerTranslator.java:61)
	at hudson.tools.ToolLocationNodeProperty.getToolHome(ToolLocationNodeProperty.java:107)
	at hudson.tools.ToolInstallation.translateFor(ToolInstallation.java:203)
	at hudson.tasks.Maven$MavenInstallation.forNode(Maven.java:595)
	at hudson.maven.MavenModuleSetBuild.getEnvironment(MavenModuleSetBuild.java:171)
	at hudson.scm.SubversionSCM.checkout(SubversionSCM.java:682)
	at hudson.model.AbstractProject.checkout(AbstractProject.java:1331)
	at hudson.model.AbstractBuild$AbstractBuildExecution.defaultCheckout(AbstractBuild.java:682)
	at jenkins.scm.SCMCheckoutStrategy.checkout(SCMCheckoutStrategy.java:88)
	at hudson.model.AbstractBuild$AbstractBuildExecution.run(AbstractBuild.java:587)
	at hudson.model.Run.execute(Run.java:1568)
	at hudson.maven.MavenModuleSetBuild.run(MavenModuleSetBuild.java:477)
	at hudson.model.ResourceController.execute(ResourceController.java:88)
	at hudson.model.Executor.run(Executor.java:236)
Caused by: java.io.IOException: Failed to mkdirs: /home/hudson/tools/maven/apache-maven-3.0.4
	at hudson.FilePath.mkdirs(FilePath.java:990)
	at hudson.FilePath.installIfNecessaryFrom(FilePath.java:721)
	... 15 more
Retrying after 10 seconds
hudson.util.IOException2: Failed to install http://archive.apache.org/dist/maven/binaries/apache-maven-3.0.4-bin.zip
to /home/hudson/tools/maven/apache-maven-3.0.4
	at hudson.FilePath.installIfNecessaryFrom(FilePath.java:742)
	at hudson.tools.DownloadFromUrlInstaller.performInstallation(DownloadFromUrlInstaller.java:72)
	at hudson.tools.InstallerTranslator.getToolHome(InstallerTranslator.java:61)
	at hudson.tools.ToolLocationNodeProperty.getToolHome(ToolLocationNodeProperty.java:107)
	at hudson.tools.ToolInstallation.translateFor(ToolInstallation.java:203)
	at hudson.tasks.Maven$MavenInstallation.forNode(Maven.java:595)
	at hudson.maven.MavenModuleSetBuild.getEnvironment(MavenModuleSetBuild.java:171)
	at hudson.scm.SubversionSCM.checkout(SubversionSCM.java:682)
	at hudson.model.AbstractProject.checkout(AbstractProject.java:1331)
	at hudson.model.AbstractBuild$AbstractBuildExecution.defaultCheckout(AbstractBuild.java:682)
	at jenkins.scm.SCMCheckoutStrategy.checkout(SCMCheckoutStrategy.java:88)
	at hudson.model.AbstractBuild$AbstractBuildExecution.run(AbstractBuild.java:587)
	at hudson.model.Run.execute(Run.java:1568)
	at hudson.maven.MavenModuleSetBuild.run(MavenModuleSetBuild.java:477)
	at hudson.model.ResourceController.execute(ResourceController.java:88)
	at hudson.model.Executor.run(Executor.java:236)
Caused by: java.io.IOException: Failed to mkdirs: /home/hudson/tools/maven/apache-maven-3.0.4
	at hudson.FilePath.mkdirs(FilePath.java:990)
	at hudson.FilePath.installIfNecessaryFrom(FilePath.java:721)
	... 15 more

Mime
View raw message