jena-commits mailing list archives

Site index · List index
Message view « Date » · « Thread »
Top « Date » · « Thread »
From Apache Jenkins Server <jenk...@builds.apache.org>
Subject Build failed in Jenkins: Jena_Development_Test_Windows #92
Date Sun, 03 Mar 2013 07:50:05 GMT
See <https://builds.apache.org/job/Jena_Development_Test_Windows/92/changes>

Changes:

[andy] Tidy up.

------------------------------------------
Started by an SCM change
Building remotely on windows1 in workspace <https://builds.apache.org/job/Jena_Development_Test_Windows/ws/>
Cleaning up <https://builds.apache.org/job/Jena_Development_Test_Windows/ws/trunk>
Deleting <https://builds.apache.org/job/Jena_Development_Test_Windows/ws/trunk\target>
Deleting <https://builds.apache.org/job/Jena_Development_Test_Windows/ws/trunk\jena-arq\target>
Deleting <https://builds.apache.org/job/Jena_Development_Test_Windows/ws/trunk\jena-iri\target>
Deleting <https://builds.apache.org/job/Jena_Development_Test_Windows/ws/trunk\jena-parent\target>
Deleting <https://builds.apache.org/job/Jena_Development_Test_Windows/ws/trunk\apache-jena\target>
Deleting <https://builds.apache.org/job/Jena_Development_Test_Windows/ws/trunk\apache-jena-libs\target>
Deleting <https://builds.apache.org/job/Jena_Development_Test_Windows/ws/trunk\jena-tdb\target>
Deleting <https://builds.apache.org/job/Jena_Development_Test_Windows/ws/trunk\jena-core\target>
Deleting <https://builds.apache.org/job/Jena_Development_Test_Windows/ws/trunk\jena-fuseki\target>
Updating http://svn.apache.org/repos/asf/jena/trunk
U         jena-arq\src\main\java\org\apache\jena\riot\RiotReader.java
U         jena-arq\src\main\java\org\apache\jena\riot\RiotWriter.java
U         jena-arq\src\main\java\org\apache\jena\riot\RDFDataMgr.java
U         jena-arq\src-examples\arq\examples\riot\ExRIOT_2.java
At revision 1452015
Parsing POMs
[trunk] $ f:\hudson\tools\java\latest-1.6-64/bin/java -cp f:\hudson\hudson-slave\maven3-agent.jar;F:\home\hudson\tools\maven\apache-maven-3.0.3\boot\plexus-classworlds-2.4.jar
org.jvnet.hudson.maven3.agent.Maven3Main /home/hudson/tools/maven/apache-maven-3.0.3 C:\Users\hudson\AppData\LocalLow\Sun\Java\Deployment\cache\6.0\39\4bb6b7e7-33fec62f
f:\hudson\hudson-slave\maven3-interceptor.jar 56875
<===[JENKINS REMOTING CAPACITY]===>   channel started
log4j:WARN No appenders could be found for logger (org.apache.commons.beanutils.converters.BooleanConverter).
log4j:WARN Please initialize the log4j system properly.
Executing Maven:  -B -f <https://builds.apache.org/job/Jena_Development_Test_Windows/ws/trunk\pom.xml>
-Dmaven.repo.local=f:\hudson\hudson-slave\maven-repositories\1 clean test
[INFO] Scanning for projects...
[INFO] ------------------------------------------------------------------------
[INFO] Reactor Build Order:
[INFO] 
[INFO] Apache Jena - Parent
[INFO] Apache Jena - IRI
[INFO] Apache Jena - CORE API
[INFO] Apache Jena - ARQ (SPARQL 1.1 Query Engine)
[INFO] Apache Jena - TDB (Native Triple Store)
[INFO] Apache Jena - Fuseki (SPARQL 1.1 Server)
[INFO] Apache Jena - Libraries POM
[INFO] Apache Jena - Distribution
[INFO] Apache Jena
[INFO]                                                                         
[INFO] ------------------------------------------------------------------------
[INFO] Building Apache Jena - Parent 6-SNAPSHOT
[INFO] ------------------------------------------------------------------------
[INFO] 
[INFO] --- maven-clean-plugin:2.4.1:clean (default-clean) @ jena-parent ---
[INFO] 
[INFO] --- maven-enforcer-plugin:1.2:enforce (enforce) @ jena-parent ---
[INFO] 
[INFO] --- maven-remote-resources-plugin:1.2.1:process (default) @ jena-parent ---
[INFO]                                                                         
[INFO] ------------------------------------------------------------------------
[INFO] Building Apache Jena - IRI 0.9.6-SNAPSHOT
[INFO] ------------------------------------------------------------------------
[INFO] 
[INFO] --- maven-clean-plugin:2.4.1:clean (default-clean) @ jena-iri ---
[INFO] 
[INFO] --- maven-enforcer-plugin:1.2:enforce (enforce) @ jena-iri ---
[INFO] 
[INFO] --- maven-remote-resources-plugin:1.2.1:process (default) @ jena-iri ---
[INFO] 
[INFO] --- maven-resources-plugin:2.6:resources (default-resources) @ jena-iri ---
[INFO] Using 'UTF-8' encoding to copy filtered resources.
[INFO] Copying 0 resource
[INFO] Copying 3 resources
[INFO] 
[INFO] --- maven-compiler-plugin:2.5.1:compile (default-compile) @ jena-iri ---
[INFO] Compiling 44 source files to F:\hudson\hudson-slave\workspace\Jena_Development_Test_Windows\trunk\jena-iri\target\classes
[INFO] 
[INFO] --- maven-resources-plugin:2.6:testResources (default-testResources) @ jena-iri ---
[INFO] Using 'UTF-8' encoding to copy filtered resources.
[INFO] Copying 4 resources
[INFO] Copying 3 resources
[INFO] 
[INFO] --- maven-compiler-plugin:2.5.1:testCompile (default-testCompile) @ jena-iri ---
[INFO] Compiling 22 source files to F:\hudson\hudson-slave\workspace\Jena_Development_Test_Windows\trunk\jena-iri\target\test-classes
[INFO] 
[INFO] --- maven-surefire-plugin:2.12.4:test (default-test) @ jena-iri ---
[INFO] Surefire report directory: F:\hudson\hudson-slave\workspace\Jena_Development_Test_Windows\trunk\jena-iri\target\surefire-reports

-------------------------------------------------------
 T E S T S
-------------------------------------------------------
Running org.apache.jena.iri.test.TestPackage
#
# There is insufficient memory for the Java Runtime Environment to continue.
# Native memory allocation (malloc) failed to allocate 1199248 bytes for Chunk::new
# An error report file with more information is saved as:
# F:\hudson\hudson-slave\workspace\Jena_Development_Test_Windows\trunk\jena-iri\hs_err_pid7272.log

Results :

Tests run: 0, Failures: 0, Errors: 0, Skipped: 0

[JENKINS] Recording test results
[INFO] ------------------------------------------------------------------------
[INFO] Reactor Summary:
[INFO] 
[INFO] Apache Jena - Parent .............................. SUCCESS [16.449s]
[INFO] Apache Jena - IRI ................................. FAILURE [11.285s]
[INFO] Apache Jena - CORE API ............................ SKIPPED
[INFO] Apache Jena - ARQ (SPARQL 1.1 Query Engine) ....... SKIPPED
[INFO] Apache Jena - TDB (Native Triple Store) ........... SKIPPED
[INFO] Apache Jena - Fuseki (SPARQL 1.1 Server) .......... SKIPPED
[INFO] Apache Jena - Libraries POM ....................... SKIPPED
[INFO] Apache Jena - Distribution ........................ SKIPPED
[INFO] Apache Jena ....................................... SKIPPED
[INFO] ------------------------------------------------------------------------
[INFO] BUILD FAILURE
[INFO] ------------------------------------------------------------------------
[INFO] Total time: 28.294s
[INFO] Finished at: Sun Mar 03 07:49:50 GMT 2013
[INFO] Final Memory: 17M/77M
[INFO] ------------------------------------------------------------------------
[JENKINS] Archiving disabled
[JENKINS] Archiving disabled
[JENKINS] Archiving disabled
[JENKINS] Archiving disabled
[JENKINS] Archiving disabled
[JENKINS] Archiving disabled
[JENKINS] Archiving disabled
[JENKINS] Archiving disabled
[JENKINS] Archiving disabled
Waiting for Jenkins to finish collecting data
mavenExecutionResult exceptions not empty
message : Failed to execute goal org.apache.maven.plugins:maven-surefire-plugin:2.12.4:test
(default-test) on project jena-iri: Execution default-test of goal org.apache.maven.plugins:maven-surefire-plugin:2.12.4:test
failed: The forked VM terminated without saying properly goodbye. VM crash or System.exit
called ?
cause : Execution default-test of goal org.apache.maven.plugins:maven-surefire-plugin:2.12.4:test
failed: The forked VM terminated without saying properly goodbye. VM crash or System.exit
called ?
Stack trace : 
org.apache.maven.lifecycle.LifecycleExecutionException: Failed to execute goal org.apache.maven.plugins:maven-surefire-plugin:2.12.4:test
(default-test) on project jena-iri: Execution default-test of goal org.apache.maven.plugins:maven-surefire-plugin:2.12.4:test
failed: The forked VM terminated without saying properly goodbye. VM crash or System.exit
called ?
	at org.apache.maven.lifecycle.internal.MojoExecutor.execute(MojoExecutor.java:225)
	at org.apache.maven.lifecycle.internal.MojoExecutor.execute(MojoExecutor.java:153)
	at org.apache.maven.lifecycle.internal.MojoExecutor.execute(MojoExecutor.java:145)
	at org.apache.maven.lifecycle.internal.LifecycleModuleBuilder.buildProject(LifecycleModuleBuilder.java:84)
	at org.apache.maven.lifecycle.internal.LifecycleModuleBuilder.buildProject(LifecycleModuleBuilder.java:59)
	at org.apache.maven.lifecycle.internal.LifecycleStarter.singleThreadedBuild(LifecycleStarter.java:183)
	at org.apache.maven.lifecycle.internal.LifecycleStarter.execute(LifecycleStarter.java:161)
	at org.apache.maven.DefaultMaven.doExecute(DefaultMaven.java:319)
	at org.apache.maven.DefaultMaven.execute(DefaultMaven.java:156)
	at org.jvnet.hudson.maven3.launcher.Maven3Launcher.main(Maven3Launcher.java:79)
	at sun.reflect.NativeMethodAccessorImpl.invoke0(Native Method)
	at sun.reflect.NativeMethodAccessorImpl.invoke(NativeMethodAccessorImpl.java:39)
	at sun.reflect.DelegatingMethodAccessorImpl.invoke(DelegatingMethodAccessorImpl.java:25)
	at java.lang.reflect.Method.invoke(Method.java:597)
	at org.codehaus.plexus.classworlds.launcher.Launcher.launchStandard(Launcher.java:329)
	at org.codehaus.plexus.classworlds.launcher.Launcher.launch(Launcher.java:239)
	at org.jvnet.hudson.maven3.agent.Maven3Main.launch(Maven3Main.java:158)
	at hudson.maven.Maven3Builder.call(Maven3Builder.java:100)
	at hudson.maven.Maven3Builder.call(Maven3Builder.java:66)
	at hudson.remoting.UserRequest.perform(UserRequest.java:118)
	at hudson.remoting.UserRequest.perform(UserRequest.java:48)
	at hudson.remoting.Request$2.run(Request.java:326)
	at hudson.remoting.InterceptingExecutorService$1.call(InterceptingExecutorService.java:72)
	at java.util.concurrent.FutureTask$Sync.innerRun(FutureTask.java:303)
	at java.util.concurrent.FutureTask.run(FutureTask.java:138)
	at java.util.concurrent.ThreadPoolExecutor$Worker.runTask(ThreadPoolExecutor.java:886)
	at java.util.concurrent.ThreadPoolExecutor$Worker.run(ThreadPoolExecutor.java:908)
	at java.lang.Thread.run(Thread.java:662)
Caused by: org.apache.maven.plugin.PluginExecutionException: Execution default-test of goal
org.apache.maven.plugins:maven-surefire-plugin:2.12.4:test failed: The forked VM terminated
without saying properly goodbye. VM crash or System.exit called ?
	at org.apache.maven.plugin.DefaultBuildPluginManager.executeMojo(DefaultBuildPluginManager.java:110)
	at org.apache.maven.lifecycle.internal.MojoExecutor.execute(MojoExecutor.java:209)
	... 27 more
Caused by: java.lang.RuntimeException: The forked VM terminated without saying properly goodbye.
VM crash or System.exit called ?
	at org.apache.maven.plugin.surefire.booterclient.output.ForkClient.close(ForkClient.java:257)
	at org.apache.maven.plugin.surefire.booterclient.ForkStarter.fork(ForkStarter.java:301)
	at org.apache.maven.plugin.surefire.booterclient.ForkStarter.run(ForkStarter.java:116)
	at org.apache.maven.plugin.surefire.AbstractSurefireMojo.executeProvider(AbstractSurefireMojo.java:740)
	at org.apache.maven.plugin.surefire.AbstractSurefireMojo.executeAllProviders(AbstractSurefireMojo.java:682)
	at org.apache.maven.plugin.surefire.AbstractSurefireMojo.executeAfterPreconditionsChecked(AbstractSurefireMojo.java:648)
	at org.apache.maven.plugin.surefire.AbstractSurefireMojo.execute(AbstractSurefireMojo.java:586)
	at org.apache.maven.plugin.DefaultBuildPluginManager.executeMojo(DefaultBuildPluginManager.java:101)
	... 28 more
Sending e-mails to: commits@jena.apache.org
channel stopped

Mime
View raw message