jena-commits mailing list archives

Site index · List index
Message view « Date » · « Thread »
Top « Date » · « Thread »
From Apache Jenkins Server <jenk...@builds.apache.org>
Subject Build failed in Jenkins: Jena_SDB_Test » Apache Jena - SDB (SQL based triple store) #529
Date Sun, 17 Mar 2013 19:48:51 GMT
See <https://builds.apache.org/job/Jena_SDB_Test/org.apache.jena$jena-sdb/529/>

------------------------------------------
<===[JENKINS REMOTING CAPACITY]===>   channel started
log4j:WARN No appenders could be found for logger (org.apache.commons.beanutils.converters.BooleanConverter).
log4j:WARN Please initialize the log4j system properly.
Executing Maven:  -B -f <https://builds.apache.org/job/Jena_SDB_Test/org.apache.jena$jena-sdb/ws/pom.xml>
-Dmaven.repo.local=/home/jenkins/jenkins-slave/maven-repositories/1 clean install
[INFO] Scanning for projects...
[INFO]                                                                         
[INFO] ------------------------------------------------------------------------
[INFO] Building Apache Jena - SDB (SQL based triple store) 1.3.6-SNAPSHOT
[INFO] ------------------------------------------------------------------------
[INFO] 
[INFO] --- maven-clean-plugin:2.4.1:clean (default-clean) @ jena-sdb ---
[INFO] Deleting <https://builds.apache.org/job/Jena_SDB_Test/org.apache.jena$jena-sdb/ws/target>
[INFO] 
[INFO] --- maven-enforcer-plugin:1.2:enforce (enforce) @ jena-sdb ---
[INFO] 
[INFO] --- maven-remote-resources-plugin:1.2.1:process (default) @ jena-sdb ---
[INFO] 
[INFO] --- maven-resources-plugin:2.5:resources (default-resources) @ jena-sdb ---
[debug] execute contextualize
[INFO] Using 'UTF-8' encoding to copy filtered resources.
[INFO] Copying 1 resource to com/hp/hpl/jena/sdb/
[INFO] Copying 3 resources
[INFO] 
[INFO] --- maven-compiler-plugin:2.3.2:compile (default-compile) @ jena-sdb ---
[INFO] Compiling 339 source files to <https://builds.apache.org/job/Jena_SDB_Test/org.apache.jena$jena-sdb/ws/target/classes>
[INFO] -------------------------------------------------------------
[ERROR] COMPILATION ERROR : 
[INFO] -------------------------------------------------------------
[ERROR] <https://builds.apache.org/job/Jena_SDB_Test/org.apache.jena$jena-sdb/ws/src/main/java/com/hp/hpl/jena/sdb/layout1/CodecSimple.java>:[22,28]
cannot find symbol
symbol  : class NodeFactory
location: package com.hp.hpl.jena.graph
[ERROR] <https://builds.apache.org/job/Jena_SDB_Test/org.apache.jena$jena-sdb/ws/src/main/java/com/hp/hpl/jena/sdb/layout2/SQLBridge2.java>:[32,28]
cannot find symbol
symbol  : class NodeFactory
location: package com.hp.hpl.jena.graph
[ERROR] <https://builds.apache.org/job/Jena_SDB_Test/org.apache.jena$jena-sdb/ws/src/main/java/com/hp/hpl/jena/sdb/layout1/CodecSimple.java>:[55,19]
cannot find symbol
symbol  : variable NodeFactory
location: class com.hp.hpl.jena.sdb.layout1.CodecSimple
[ERROR] <https://builds.apache.org/job/Jena_SDB_Test/org.apache.jena$jena-sdb/ws/src/main/java/com/hp/hpl/jena/sdb/graph/GraphSDB.java>:[67,20]
cannot find symbol
symbol  : variable NodeFactory
location: class com.hp.hpl.jena.sdb.graph.GraphSDB
[ERROR] <https://builds.apache.org/job/Jena_SDB_Test/org.apache.jena$jena-sdb/ws/src/main/java/com/hp/hpl/jena/sdb/graph/GraphSDB.java>:[65,11]
recursive constructor invocation
[ERROR] <https://builds.apache.org/job/Jena_SDB_Test/org.apache.jena$jena-sdb/ws/src/main/java/com/hp/hpl/jena/sdb/layout2/SQLBridge2.java>:[240,23]
cannot find symbol
symbol  : variable NodeFactory
location: class com.hp.hpl.jena.sdb.layout2.SQLBridge2
[ERROR] <https://builds.apache.org/job/Jena_SDB_Test/org.apache.jena$jena-sdb/ws/src/main/java/com/hp/hpl/jena/sdb/layout2/SQLBridge2.java>:[242,23]
cannot find symbol
symbol  : variable NodeFactory
location: class com.hp.hpl.jena.sdb.layout2.SQLBridge2
[ERROR] <https://builds.apache.org/job/Jena_SDB_Test/org.apache.jena$jena-sdb/ws/src/main/java/com/hp/hpl/jena/sdb/layout2/SQLBridge2.java>:[244,23]
cannot find symbol
symbol  : variable NodeFactory
location: class com.hp.hpl.jena.sdb.layout2.SQLBridge2
[ERROR] <https://builds.apache.org/job/Jena_SDB_Test/org.apache.jena$jena-sdb/ws/src/main/java/com/hp/hpl/jena/sdb/layout2/SQLBridge2.java>:[246,23]
cannot find symbol
symbol  : variable NodeFactory
location: class com.hp.hpl.jena.sdb.layout2.SQLBridge2
[ERROR] <https://builds.apache.org/job/Jena_SDB_Test/org.apache.jena$jena-sdb/ws/src/main/java/com/hp/hpl/jena/sdb/layout2/SQLBridge2.java>:[248,23]
cannot find symbol
symbol  : variable NodeFactory
location: class com.hp.hpl.jena.sdb.layout2.SQLBridge2
[ERROR] <https://builds.apache.org/job/Jena_SDB_Test/org.apache.jena$jena-sdb/ws/src/main/java/com/hp/hpl/jena/sdb/layout2/SQLBridge2.java>:[250,23]
cannot find symbol
symbol  : variable NodeFactory
location: class com.hp.hpl.jena.sdb.layout2.SQLBridge2
[ERROR] <https://builds.apache.org/job/Jena_SDB_Test/org.apache.jena$jena-sdb/ws/src/main/java/com/hp/hpl/jena/sdb/layout2/SQLBridge2.java>:[252,23]
cannot find symbol
symbol  : variable NodeFactory
location: class com.hp.hpl.jena.sdb.layout2.SQLBridge2
[ERROR] <https://builds.apache.org/job/Jena_SDB_Test/org.apache.jena$jena-sdb/ws/src/main/java/com/hp/hpl/jena/sdb/layout2/SQLBridge2.java>:[255,23]
cannot find symbol
symbol  : variable NodeFactory
location: class com.hp.hpl.jena.sdb.layout2.SQLBridge2
[ERROR] <https://builds.apache.org/job/Jena_SDB_Test/org.apache.jena$jena-sdb/ws/src/main/java/com/hp/hpl/jena/sdb/layout2/SQLBridge2.java>:[258,19]
cannot find symbol
symbol  : variable NodeFactory
location: class com.hp.hpl.jena.sdb.layout2.SQLBridge2
[INFO] 14 errors 
[INFO] -------------------------------------------------------------

Mime
View raw message