jena-commits mailing list archives

Site index · List index
Message view « Date » · « Thread »
Top « Date » · « Thread »
From Apache Jenkins Server <jenk...@builds.apache.org>
Subject Build failed in Jenkins: Jena_SDB_Snapshot #184
Date Thu, 21 Feb 2013 04:51:19 GMT
See <https://builds.apache.org/job/Jena_SDB_Snapshot/184/changes>

Changes:

[andy] Set POMs to next release SNAPSHOT

------------------------------------------
[...truncated 599 lines...]
AU        bin/sdbdelete
AU        bin/sdbscript
AU        bin/sdbconfig
AU        bin/sdbdump
AU        bin/sdbquery
AU        bin/make_classpath_mvn
AU        bin/sdbload
AU        bin/sdbtest
AU        bin/sdb_rep
AU        bin/sdbtruncate
A         Data
AU        Data/data.ttl
AU        Data/data2.ttl
AU        log4j.properties
A         sdb.ttl
A         README.txt
A         testing
A         testing/slist.rq
A         testing/blank_manifest.ttl
A         testing/Modifiers
AU        testing/Modifiers/slice-2.rq
AU        testing/Modifiers/distinct-1.rq
AU        testing/Modifiers/slice-3.rq
AU        testing/Modifiers/distinct-2.rq
AU        testing/Modifiers/slice-4.rq
AU        testing/Modifiers/slice-5.rq
AU        testing/Modifiers/slice-6.rq
AU        testing/Modifiers/slice-7.rq
AU        testing/Modifiers/slice-8.rq
AU        testing/Modifiers/slice-9.rq
AU        testing/Modifiers/manifest.ttl
AU        testing/Modifiers/data-1.ttl
AU        testing/Modifiers/slice-1.rq
A         testing/Expressions
A         testing/Expressions/manifest.ttl
A         testing/Expressions/equals-1.rq
A         testing/Expressions/regex-1.rq
A         testing/Expressions/regex-opt-1.rq
A         testing/Expressions/equals-2.rq
A         testing/Expressions/regex-2.rq
A         testing/Expressions/regex-opt-2.rq
A         testing/Expressions/data.ttl
A         testing/Expressions/equals-3.rq
A         testing/Expressions/regex-3.rq
A         testing/Expressions/regex-opt-3.rq
A         testing/Expressions/regex-opt-4.rq
A         testing/Update
A         testing/Update/create-1.ru
A         testing/Update/drop-1.ru
A         testing/Update/data-1.ru
A         testing/Update/data-2.ru
A         testing/Update/data-3.ru
A         testing/Update/data-3.aru
A         testing/Update/data-4.ru
A         testing/Update/data-4.aru
A         testing/Update/update-1.ru
A         testing/Update/update-2.ru
A         testing/Update/update-2.aru
A         testing/Update/update-3.ru
A         testing/Update/update-3.aru
A         testing/Update/bad-1.ru
A         testing/Update/bad-2.ru
A         testing/Update/bad-3.ru
A         testing/Integration
A         testing/Integration/integrate-1.rq
A         testing/Integration/integrate-2.rq
A         testing/Integration/integrate-3.rq
A         testing/Integration/integrate-4.rq
A         testing/Integration/manifest.ttl
A         testing/Integration/data.ttl
A         testing/Unicode
A         testing/Unicode/data-uni.ttl
A         testing/Unicode/unicode-1.rq
A         testing/Unicode/unicode-2.rq
A         testing/Unicode/unicode-3.rq
A         testing/Unicode/manifest.ttl
A         testing/Unicode/unicode-4.rq
A         testing/Unicode/unicode-5.rq
A         testing/Optionals1
AU        testing/Optionals1/opt-coalesce-3.rq
A         testing/Optionals1/opt-1.rq
A         testing/Optionals1/opt-2.rq
A         testing/Optionals1/opt-3.rq
AU        testing/Optionals1/opt-4.rq
A         testing/Optionals1/manifest.ttl
A         testing/Optionals1/data-1.ttl
A         testing/Optionals1/data-2.ttl
A         testing/Optionals1/opt-coalesce-1.rq
A         testing/Optionals1/opt-coalesce-2.rq
A         testing/StoreDesc
AU        testing/StoreDesc/h2-index.ttl
A         testing/StoreDesc/ms-sql-e-hash.ttl
A         testing/StoreDesc/hsqldb-index.ttl
A         testing/StoreDesc/oracle-xe-index.ttl
A         testing/StoreDesc/derby-hash.ttl
A         testing/StoreDesc/mysql-hash.ttl
AU        testing/StoreDesc/db2-hash.ttl
AU        testing/StoreDesc/h2-hash.ttl
A         testing/StoreDesc/pgsql-index.ttl
A         testing/StoreDesc/hsqldb-hash.ttl
A         testing/StoreDesc/oracle-xe-hash.ttl
A         testing/StoreDesc/ms-sql-e-index.ttl
A         testing/StoreDesc/pgsql-hash.ttl
A         testing/StoreDesc/derby-index.ttl
A         testing/StoreDesc/mysql-index.ttl
AU        testing/StoreDesc/db2-index.ttl
A         testing/Algebra
A         testing/Algebra/filter-nested-1.rq
A         testing/Algebra/filter-nested-2.rq
A         testing/Algebra/opt-filter.rq
A         testing/Algebra/opt-filter.ttl
A         testing/Algebra/manifest.ttl
A         testing/Algebra/two-nested-opt-alt.rq
A         testing/Algebra/two-nested-opt.rq
A         testing/Algebra/data.ttl
A         testing/Algebra/two-nested-opt.ttl
A         testing/store-list-simple.ttl
A         testing/Structure
A         testing/Structure/struct-01.rq
A         testing/Structure/struct-10.rq
A         testing/Structure/struct-02.rq
A         testing/Structure/struct-03.rq
A         testing/Structure/struct-04.rq
A         testing/Structure/struct-05.rq
A         testing/Structure/manifest.ttl
A         testing/Structure/struct-06.rq
A         testing/Structure/data.ttl
A         testing/Graph
A         testing/Graph/manifest.ttl
A         testing/Graph/data-1.ttl
A         testing/Graph/quad-1.rq
A         testing/Graph/data-2.ttl
A         testing/Graph/quad-2.rq
AU        testing/Graph/quad-3.rq
A         testing/BasicPatterns
A         testing/BasicPatterns/triple-2.rq
A         testing/BasicPatterns/basic-1.rq
A         testing/BasicPatterns/triple-3.rq
A         testing/BasicPatterns/basic-2.rq
A         testing/BasicPatterns/triple-4.rq
A         testing/BasicPatterns/basic-3.rq
A         testing/BasicPatterns/manifest.ttl
A         testing/BasicPatterns/basic-empty-1.rq
A         testing/BasicPatterns/basic-empty-2.rq
A         testing/BasicPatterns/triple-1.rq
A         testing/manifest-sdb-simple.ttl
A         testing/StoreDescSimple
A         testing/StoreDescSimple/derby-layout1.ttl
A         testing/StoreDescSimple/mysql-layout1.ttl
A         testing/StoreDescSimple/pgsql-layout1.ttl
AU        testing/StoreDescSimple/db2-layout1.ttl
AU        testing/StoreDescSimple/h2-layout1.ttl
A         testing/StoreDescSimple/hsqldb-layout1.ttl
A         testing/StoreDescSimple/ms-sql-e-layout1.ttl
A         testing/StoreDescSimple/oracle-xe-layout1.ttl
AU        testing/create-1.rup
AU        testing/drop-1.rup
A         testing/store-list.ttl
A         testing/Data
A         testing/Data/data.ttl
A         testing/UnionGraph
A         testing/UnionGraph/merge-2.rq
AU        testing/UnionGraph/merge-3.rq
AU        testing/UnionGraph/merge-4.rq
AU        testing/UnionGraph/merge-5.rq
AU        testing/UnionGraph/merge-6.rq
AU        testing/UnionGraph/data-dft.ttl
AU        testing/UnionGraph/merge-A-results.srx
AU        testing/UnionGraph/merge-B-results.srx
AU        testing/UnionGraph/merge-A.rq
AU        testing/UnionGraph/merge-B.rq
A         testing/UnionGraph/merge-1-results.srx
A         testing/UnionGraph/manifest.ttl
A         testing/UnionGraph/merge-2-results.srx
AU        testing/UnionGraph/data-1.ttl
AU        testing/UnionGraph/merge-3-results.srx
AU        testing/UnionGraph/merge-4-results.srx
AU        testing/UnionGraph/data-2.ttl
AU        testing/UnionGraph/merge-5-results.srx
AU        testing/UnionGraph/merge-6-results.srx
AU        testing/UnionGraph/merge-1.rq
A         testing/General
A         testing/General/vars-1.rq
A         testing/General/vars-2.rq
A         testing/General/vars-3.rq
A         testing/General/vars-4.rq
A         testing/General/vars-5.rq
A         testing/General/term-01.rq
A         testing/General/term-10.rq
A         testing/General/term-02.rq
A         testing/General/term-11.rq
A         testing/General/manifest.ttl
A         testing/General/term-03.rq
A         testing/General/term-12.rq
A         testing/General/data-1.ttl
A         testing/General/term-04.rq
A         testing/General/term-05.rq
A         testing/General/term-06.rq
A         testing/General/term-07.rq
A         testing/General/term-08.rq
A         testing/General/term-09.rq
A         testing/Assembler
AU        testing/Assembler/connection.ttl
AU        testing/Assembler/dataset.ttl
AU        testing/Assembler/dataset2.ttl
AU        testing/Assembler/graph-assembler.ttl
AU        testing/Assembler/store.ttl
A         testing/manifest-sdb.ttl
AU        assembly.xml
A         Old
A         Old/PG_GRANT
AU        Old/ToDo-AFS
 U        .
At revision 1448512
Parsing POMs
ERROR: Failed to parse POMs
hudson.util.IOException2: remote file operation failed: <https://builds.apache.org/job/Jena_SDB_Snapshot/ws/jena-sdb>
at hudson.remoting.Channel@3d4ab197:ubuntu4
	at hudson.FilePath.act(FilePath.java:861)
	at hudson.FilePath.act(FilePath.java:838)
	at hudson.maven.MavenModuleSetBuild$MavenModuleSetBuildExecution.parsePoms(MavenModuleSetBuild.java:862)
	at hudson.maven.MavenModuleSetBuild$MavenModuleSetBuildExecution.doRun(MavenModuleSetBuild.java:620)
	at hudson.model.AbstractBuild$AbstractBuildExecution.run(AbstractBuild.java:592)
	at hudson.model.Run.execute(Run.java:1568)
	at hudson.maven.MavenModuleSetBuild.run(MavenModuleSetBuild.java:477)
	at hudson.model.ResourceController.execute(ResourceController.java:88)
	at hudson.model.Executor.run(Executor.java:236)
Caused by: hudson.remoting.ProxyException: hudson.maven.MavenModuleSetBuild$MavenExecutionException:
org.apache.maven.project.ProjectBuildingException: Some problems were encountered while processing
the POMs:
[FATAL] Non-resolvable parent POM: Could not find artifact org.apache.jena:jena-parent:pom:6-SNAPSHOT
and 'parent.relativePath' points at wrong local POM @ line 29, column 11

	at hudson.maven.MavenModuleSetBuild$PomParser.invoke(MavenModuleSetBuild.java:1229)
	at hudson.maven.MavenModuleSetBuild$PomParser.invoke(MavenModuleSetBuild.java:997)
	at hudson.FilePath$FileCallableWrapper.call(FilePath.java:2348)
	at hudson.remoting.UserRequest.perform(UserRequest.java:118)
	at hudson.remoting.UserRequest.perform(UserRequest.java:48)
	at hudson.remoting.Request$2.run(Request.java:326)
	at hudson.remoting.InterceptingExecutorService$1.call(InterceptingExecutorService.java:72)
	at java.util.concurrent.FutureTask$Sync.innerRun(FutureTask.java:334)
	at java.util.concurrent.FutureTask.run(FutureTask.java:166)
	at java.util.concurrent.ThreadPoolExecutor.runWorker(ThreadPoolExecutor.java:1110)
	at java.util.concurrent.ThreadPoolExecutor$Worker.run(ThreadPoolExecutor.java:603)
	at java.lang.Thread.run(Thread.java:679)
Caused by: hudson.remoting.ProxyException: org.apache.maven.project.ProjectBuildingException:
Some problems were encountered while processing the POMs:
[FATAL] Non-resolvable parent POM: Could not find artifact org.apache.jena:jena-parent:pom:6-SNAPSHOT
and 'parent.relativePath' points at wrong local POM @ line 29, column 11

	at org.apache.maven.project.DefaultProjectBuilder.build(DefaultProjectBuilder.java:363)
	at hudson.maven.MavenEmbedder.buildProjects(MavenEmbedder.java:361)
	at hudson.maven.MavenEmbedder.readProjects(MavenEmbedder.java:331)
	at hudson.maven.MavenModuleSetBuild$PomParser.invoke(MavenModuleSetBuild.java:1179)
	... 11 more

Mime
View raw message