jena-commits mailing list archives

Site index · List index
Message view « Date » · « Thread »
Top « Date » · « Thread »
From Apache Jenkins Server <jenk...@builds.apache.org>
Subject Build failed in Jenkins: Jena_SDB #455
Date Tue, 05 Feb 2013 04:22:28 GMT
See <https://builds.apache.org/job/Jena_SDB/455/changes>

Changes:

[sallen] Further refinements to the streaming update capabilities.

------------------------------------------
[...truncated 620 lines...]
A         testing/Integration/integrate-1.rq
A         testing/Integration/integrate-2.rq
A         testing/Integration/integrate-3.rq
A         testing/Integration/integrate-4.rq
A         testing/Integration/manifest.ttl
A         testing/Integration/data.ttl
A         testing/Unicode
A         testing/Unicode/data-uni.ttl
A         testing/Unicode/unicode-1.rq
A         testing/Unicode/unicode-2.rq
A         testing/Unicode/unicode-3.rq
A         testing/Unicode/manifest.ttl
A         testing/Unicode/unicode-4.rq
A         testing/Unicode/unicode-5.rq
A         testing/Optionals1
AU        testing/Optionals1/opt-coalesce-3.rq
A         testing/Optionals1/opt-1.rq
A         testing/Optionals1/opt-2.rq
A         testing/Optionals1/opt-3.rq
AU        testing/Optionals1/opt-4.rq
A         testing/Optionals1/manifest.ttl
A         testing/Optionals1/data-1.ttl
A         testing/Optionals1/data-2.ttl
A         testing/Optionals1/opt-coalesce-1.rq
A         testing/Optionals1/opt-coalesce-2.rq
A         testing/StoreDesc
AU        testing/StoreDesc/h2-index.ttl
A         testing/StoreDesc/ms-sql-e-hash.ttl
A         testing/StoreDesc/hsqldb-index.ttl
A         testing/StoreDesc/oracle-xe-index.ttl
A         testing/StoreDesc/derby-hash.ttl
A         testing/StoreDesc/mysql-hash.ttl
AU        testing/StoreDesc/db2-hash.ttl
AU        testing/StoreDesc/h2-hash.ttl
A         testing/StoreDesc/pgsql-index.ttl
A         testing/StoreDesc/hsqldb-hash.ttl
A         testing/StoreDesc/oracle-xe-hash.ttl
A         testing/StoreDesc/ms-sql-e-index.ttl
A         testing/StoreDesc/pgsql-hash.ttl
A         testing/StoreDesc/derby-index.ttl
A         testing/StoreDesc/mysql-index.ttl
AU        testing/StoreDesc/db2-index.ttl
A         testing/Algebra
A         testing/Algebra/filter-nested-1.rq
A         testing/Algebra/filter-nested-2.rq
A         testing/Algebra/opt-filter.rq
A         testing/Algebra/opt-filter.ttl
A         testing/Algebra/manifest.ttl
A         testing/Algebra/two-nested-opt-alt.rq
A         testing/Algebra/two-nested-opt.rq
A         testing/Algebra/data.ttl
A         testing/Algebra/two-nested-opt.ttl
A         testing/store-list-simple.ttl
A         testing/Structure
A         testing/Structure/struct-01.rq
A         testing/Structure/struct-10.rq
A         testing/Structure/struct-02.rq
A         testing/Structure/struct-03.rq
A         testing/Structure/struct-04.rq
A         testing/Structure/struct-05.rq
A         testing/Structure/manifest.ttl
A         testing/Structure/struct-06.rq
A         testing/Structure/data.ttl
A         testing/Graph
A         testing/Graph/manifest.ttl
A         testing/Graph/data-1.ttl
A         testing/Graph/quad-1.rq
A         testing/Graph/data-2.ttl
A         testing/Graph/quad-2.rq
AU        testing/Graph/quad-3.rq
A         testing/BasicPatterns
A         testing/BasicPatterns/triple-2.rq
A         testing/BasicPatterns/basic-1.rq
A         testing/BasicPatterns/triple-3.rq
A         testing/BasicPatterns/basic-2.rq
A         testing/BasicPatterns/triple-4.rq
A         testing/BasicPatterns/basic-3.rq
A         testing/BasicPatterns/manifest.ttl
A         testing/BasicPatterns/basic-empty-1.rq
A         testing/BasicPatterns/basic-empty-2.rq
A         testing/BasicPatterns/triple-1.rq
A         testing/manifest-sdb-simple.ttl
A         testing/StoreDescSimple
A         testing/StoreDescSimple/derby-layout1.ttl
A         testing/StoreDescSimple/mysql-layout1.ttl
A         testing/StoreDescSimple/pgsql-layout1.ttl
AU        testing/StoreDescSimple/db2-layout1.ttl
AU        testing/StoreDescSimple/h2-layout1.ttl
A         testing/StoreDescSimple/hsqldb-layout1.ttl
A         testing/StoreDescSimple/ms-sql-e-layout1.ttl
A         testing/StoreDescSimple/oracle-xe-layout1.ttl
AU        testing/create-1.rup
AU        testing/drop-1.rup
A         testing/store-list.ttl
A         testing/Data
A         testing/Data/data.ttl
A         testing/UnionGraph
A         testing/UnionGraph/merge-2.rq
AU        testing/UnionGraph/merge-3.rq
AU        testing/UnionGraph/merge-4.rq
AU        testing/UnionGraph/merge-5.rq
AU        testing/UnionGraph/merge-6.rq
AU        testing/UnionGraph/data-dft.ttl
AU        testing/UnionGraph/merge-A-results.srx
AU        testing/UnionGraph/merge-B-results.srx
AU        testing/UnionGraph/merge-A.rq
AU        testing/UnionGraph/merge-B.rq
A         testing/UnionGraph/merge-1-results.srx
A         testing/UnionGraph/manifest.ttl
A         testing/UnionGraph/merge-2-results.srx
AU        testing/UnionGraph/data-1.ttl
AU        testing/UnionGraph/merge-3-results.srx
AU        testing/UnionGraph/merge-4-results.srx
AU        testing/UnionGraph/data-2.ttl
AU        testing/UnionGraph/merge-5-results.srx
AU        testing/UnionGraph/merge-6-results.srx
AU        testing/UnionGraph/merge-1.rq
A         testing/General
A         testing/General/vars-1.rq
A         testing/General/vars-2.rq
A         testing/General/vars-3.rq
A         testing/General/vars-4.rq
A         testing/General/vars-5.rq
A         testing/General/term-01.rq
A         testing/General/term-10.rq
A         testing/General/term-02.rq
A         testing/General/term-11.rq
A         testing/General/manifest.ttl
A         testing/General/term-03.rq
A         testing/General/term-12.rq
A         testing/General/data-1.ttl
A         testing/General/term-04.rq
A         testing/General/term-05.rq
A         testing/General/term-06.rq
A         testing/General/term-07.rq
A         testing/General/term-08.rq
A         testing/General/term-09.rq
A         testing/Assembler
AU        testing/Assembler/connection.ttl
AU        testing/Assembler/dataset.ttl
AU        testing/Assembler/dataset2.ttl
AU        testing/Assembler/graph-assembler.ttl
AU        testing/Assembler/store.ttl
A         testing/manifest-sdb.ttl
AU        assembly.xml
A         Old
A         Old/PG_GRANT
AU        Old/ToDo-AFS
 U        .
At revision 1442466
Parsing POMs
Modules changed, recalculating dependency graph
[jena-sdb] $ /home/hudson/tools/java/latest1.6/bin/java -cp /home/jenkins/jenkins-slave/maven3-agent.jar:/home/hudson/tools/maven/latest3/boot/plexus-classworlds-2.4.jar
org.jvnet.hudson.maven3.agent.Maven3Main /home/hudson/tools/maven/latest3/ /home/jenkins/jenkins-slave/slave.jar
/home/jenkins/jenkins-slave/maven3-interceptor.jar 58148
<===[JENKINS REMOTING CAPACITY]===>channel started
   log4j:WARN No appenders could be found for logger (org.apache.commons.beanutils.converters.BooleanConverter).
log4j:WARN Please initialize the log4j system properly.
Executing Maven:  -B -f <https://builds.apache.org/job/Jena_SDB/ws/jena-sdb/pom.xml>
-Dmaven.repo.local=/home/jenkins/jenkins-slave/maven-repositories/1 clean install
[INFO] Scanning for projects...
Projects to build: [MavenProject: org.apache.jena:jena-sdb:1.3.6-SNAPSHOT @ <https://builds.apache.org/job/Jena_SDB/ws/jena-sdb/pom.xml]>
projectStarted org.apache.jena:jena-sdb:1.3.6-SNAPSHOT
[INFO]                                                                         
[INFO] ------------------------------------------------------------------------
[INFO] Building Apache Jena - SDB (SQL based triple store) 1.3.6-SNAPSHOT
[INFO] ------------------------------------------------------------------------
mojoStarted org.apache.maven.plugins:maven-clean-plugin:2.4.1(default-clean)
[INFO] 
[INFO] --- maven-clean-plugin:2.4.1:clean (default-clean) @ jena-sdb ---
mojoSucceeded org.apache.maven.plugins:maven-clean-plugin:2.4.1(default-clean)
mojoStarted org.apache.maven.plugins:maven-remote-resources-plugin:1.2.1(default)
[INFO] 
[INFO] --- maven-remote-resources-plugin:1.2.1:process (default) @ jena-sdb ---
mojoSucceeded org.apache.maven.plugins:maven-remote-resources-plugin:1.2.1(default)
mojoStarted org.apache.maven.plugins:maven-resources-plugin:2.5(default-resources)
[INFO] 
[INFO] --- maven-resources-plugin:2.5:resources (default-resources) @ jena-sdb ---
[debug] execute contextualize
[INFO] Using 'UTF-8' encoding to copy filtered resources.
[INFO] Copying 1 resource to com/hp/hpl/jena/sdb/
[INFO] Copying 3 resources
mojoSucceeded org.apache.maven.plugins:maven-resources-plugin:2.5(default-resources)
mojoStarted org.apache.maven.plugins:maven-compiler-plugin:2.3.2(default-compile)
[INFO] 
[INFO] --- maven-compiler-plugin:2.3.2:compile (default-compile) @ jena-sdb ---
[INFO] Compiling 339 source files to <https://builds.apache.org/job/Jena_SDB/ws/jena-sdb/target/classes>
[INFO] -------------------------------------------------------------
[ERROR] COMPILATION ERROR : 
[INFO] -------------------------------------------------------------
[ERROR] <https://builds.apache.org/job/Jena_SDB/ws/jena-sdb/src/main/java/com/hp/hpl/jena/sdb/store/DatasetStoreGraph.java>:[40,7]
com.hp.hpl.jena.sdb.store.DatasetStoreGraph is not abstract and does not override abstract
method finishRequest(com.hp.hpl.jena.update.UpdateRequest) in com.hp.hpl.jena.update.GraphStore
[ERROR] <https://builds.apache.org/job/Jena_SDB/ws/jena-sdb/src/main/java/com/hp/hpl/jena/sdb/store/DatasetStoreGraph.java>:[70,4]
method does not override or implement a method from a supertype
[ERROR] <https://builds.apache.org/job/Jena_SDB/ws/jena-sdb/src/main/java/com/hp/hpl/jena/sdb/store/DatasetStoreGraph.java>:[74,4]
method does not override or implement a method from a supertype
[ERROR] <https://builds.apache.org/job/Jena_SDB/ws/jena-sdb/src/main/java/com/hp/hpl/jena/sdb/modify/UpdateEngineSDB.java>:[41,8]
<anonymous com.hp.hpl.jena.sdb.modify.UpdateEngineSDB$1> is not abstract and does not
override abstract method createStreaming(com.hp.hpl.jena.update.GraphStore,com.hp.hpl.jena.sparql.engine.binding.Binding,com.hp.hpl.jena.sparql.util.Context)
in com.hp.hpl.jena.sparql.modify.UpdateEngineFactory
[ERROR] <https://builds.apache.org/job/Jena_SDB/ws/jena-sdb/src/main/java/com/hp/hpl/jena/sdb/modify/UpdateEngineSDB.java>:[42,12]
method does not override or implement a method from a supertype
mojoFailed org.apache.maven.plugins:maven-compiler-plugin:2.3.2(default-compile)[ERROR] <https://builds.apache.org/job/Jena_SDB/ws/jena-sdb/src/main/java/com/hp/hpl/jena/sdb/modify/UpdateEngineSDB.java>:[48,12]
method does not override or implement a method from a supertype
[INFO] 6 errors 
[INFO] -------------------------------------------------------------

projectFailed org.apache.jena:jena-sdb:1.3.6-SNAPSHOT
sessionEnded
[INFO] ------------------------------------------------------------------------
[INFO] BUILD FAILURE
[INFO] ------------------------------------------------------------------------
[INFO] Total time: 28.635s
[INFO] Finished at: Tue Feb 05 04:22:24 UTC 2013
[INFO] Final Memory: 18M/178M
[INFO] ------------------------------------------------------------------------
Projects to build: [MavenProject: org.apache.jena:jena-sdb:1.3.6-SNAPSHOT @ <https://builds.apache.org/job/Jena_SDB/ws/jena-sdb/pom.xml]>
[JENKINS] Archiving disabled
Waiting for Jenkins to finish collecting data
mavenExecutionResult exceptions not empty
message : Failed to execute goal org.apache.maven.plugins:maven-compiler-plugin:2.3.2:compile
(default-compile) on project jena-sdb: Compilation failure
cause : Compilation failure
Stack trace : 
org.apache.maven.lifecycle.LifecycleExecutionException: Failed to execute goal org.apache.maven.plugins:maven-compiler-plugin:2.3.2:compile
(default-compile) on project jena-sdb: Compilation failure
	at org.apache.maven.lifecycle.internal.MojoExecutor.execute(MojoExecutor.java:213)
	at org.apache.maven.lifecycle.internal.MojoExecutor.execute(MojoExecutor.java:153)
	at org.apache.maven.lifecycle.internal.MojoExecutor.execute(MojoExecutor.java:145)
	at org.apache.maven.lifecycle.internal.LifecycleModuleBuilder.buildProject(LifecycleModuleBuilder.java:84)
	at org.apache.maven.lifecycle.internal.LifecycleModuleBuilder.buildProject(LifecycleModuleBuilder.java:59)
	at org.apache.maven.lifecycle.internal.LifecycleStarter.singleThreadedBuild(LifecycleStarter.java:183)
	at org.apache.maven.lifecycle.internal.LifecycleStarter.execute(LifecycleStarter.java:161)
	at org.apache.maven.DefaultMaven.doExecute(DefaultMaven.java:320)
	at org.apache.maven.DefaultMaven.execute(DefaultMaven.java:156)
	at org.jvnet.hudson.maven3.launcher.Maven3Launcher.main(Maven3Launcher.java:79)
	at sun.reflect.NativeMethodAccessorImpl.invoke0(Native Method)
	at sun.reflect.NativeMethodAccessorImpl.invoke(NativeMethodAccessorImpl.java:39)
	at sun.reflect.DelegatingMethodAccessorImpl.invoke(DelegatingMethodAccessorImpl.java:25)
	at java.lang.reflect.Method.invoke(Method.java:597)
	at org.codehaus.plexus.classworlds.launcher.Launcher.launchStandard(Launcher.java:329)
	at org.codehaus.plexus.classworlds.launcher.Launcher.launch(Launcher.java:239)
	at org.jvnet.hudson.maven3.agent.Maven3Main.launch(Maven3Main.java:158)
	at hudson.maven.Maven3Builder.call(Maven3Builder.java:100)
	at hudson.maven.Maven3Builder.call(Maven3Builder.java:66)
	at hudson.remoting.UserRequest.perform(UserRequest.java:118)
	at hudson.remoting.UserRequest.perform(UserRequest.java:48)
	at hudson.remoting.Request$2.run(Request.java:326)
	at hudson.remoting.InterceptingExecutorService$1.call(InterceptingExecutorService.java:72)
	at java.util.concurrent.FutureTask$Sync.innerRun(FutureTask.java:303)
	at java.util.concurrent.FutureTask.run(FutureTask.java:138)
	at java.util.concurrent.ThreadPoolExecutor$Worker.runTask(ThreadPoolExecutor.java:886)
	at java.util.concurrent.ThreadPoolExecutor$Worker.run(ThreadPoolExecutor.java:908)
	at java.lang.Thread.run(Thread.java:662)
Caused by: org.apache.maven.plugin.CompilationFailureException: Compilation failure
	at org.apache.maven.plugin.AbstractCompilerMojo.execute(AbstractCompilerMojo.java:656)
	at org.apache.maven.plugin.CompilerMojo.execute(CompilerMojo.java:128)
	at org.apache.maven.plugin.DefaultBuildPluginManager.executeMojo(DefaultBuildPluginManager.java:101)
	at org.apache.maven.lifecycle.internal.MojoExecutor.execute(MojoExecutor.java:209)
	... 27 more
Sending e-mails to: commits@jena.apache.org
channel stopped

Mime
View raw message