jena-commits mailing list archives

Site index · List index
Message view « Date » · « Thread »
Top « Date » · « Thread »
From Apache Jenkins Server <jenk...@builds.apache.org>
Subject Build failed in Jenkins: Jena__Development_Test #484
Date Sun, 10 Feb 2013 19:51:10 GMT
See <https://builds.apache.org/job/Jena__Development_Test/484/changes>

Changes:

[andy] Thread safe initialization

[andy] Initialize RIOT from jena-core.

------------------------------------------
[...truncated 191 lines...]
projectSucceeded org.apache.jena:jena-core:2.10.0-SNAPSHOT
projectStarted org.apache.jena:jena-arq:2.10.0-SNAPSHOT
[INFO]                                                                         
[INFO] ------------------------------------------------------------------------
[INFO] Building Apache Jena - ARQ (SPARQL 1.1 Query Engine) 2.10.0-SNAPSHOT
[INFO] ------------------------------------------------------------------------
mojoStarted org.apache.maven.plugins:maven-clean-plugin:2.4.1(default-clean)
[INFO] 
[INFO] --- maven-clean-plugin:2.4.1:clean (default-clean) @ jena-arq ---
mojoSucceeded org.apache.maven.plugins:maven-clean-plugin:2.4.1(default-clean)
mojoStarted org.apache.maven.plugins:maven-remote-resources-plugin:1.2.1(default)
[INFO] 
[INFO] --- maven-remote-resources-plugin:1.2.1:process (default) @ jena-arq ---
mojoSucceeded org.apache.maven.plugins:maven-remote-resources-plugin:1.2.1(default)
mojoStarted org.apache.maven.plugins:maven-resources-plugin:2.6(default-resources)[INFO] Using
'UTF-8' encoding to copy filtered resources.
[INFO] Copying 1 resource to com/hp/hpl/jena/sparql/
[INFO] Copying 3 resources
[INFO] Copying 3 resources

[INFO] 
[INFO] --- maven-resources-plugin:2.6:resources (default-resources) @ jena-arq ---
mojoSucceeded org.apache.maven.plugins:maven-resources-plugin:2.6(default-resources)
mojoStarted org.apache.maven.plugins:maven-compiler-plugin:2.5.1(default-compile)
[INFO] 
[INFO] --- maven-compiler-plugin:2.5.1:compile (default-compile) @ jena-arq ---
[INFO] Compiling 1344 source files to <https://builds.apache.org/job/Jena__Development_Test/ws/trunk/jena-arq/target/classes>
mojoSucceeded org.apache.maven.plugins:maven-compiler-plugin:2.5.1(default-compile)
mojoStarted org.apache.maven.plugins:maven-resources-plugin:2.6(default-testResources)[INFO]
Using 'UTF-8' encoding to copy filtered resources.
[INFO] Copying 2 resources
[INFO] Copying 3 resources

[INFO] 
[INFO] --- maven-resources-plugin:2.6:testResources (default-testResources) @ jena-arq ---
mojoSucceeded org.apache.maven.plugins:maven-resources-plugin:2.6(default-testResources)
mojoStarted org.apache.maven.plugins:maven-compiler-plugin:2.5.1(default-testCompile)
[INFO] 
[INFO] --- maven-compiler-plugin:2.5.1:testCompile (default-testCompile) @ jena-arq ---
[INFO] Compiling 234 source files to <https://builds.apache.org/job/Jena__Development_Test/ws/trunk/jena-arq/target/test-classes>
mojoSucceeded org.apache.maven.plugins:maven-compiler-plugin:2.5.1(default-testCompile)
mojoStarted org.apache.maven.plugins:maven-surefire-plugin:2.12.4(default-test)[INFO] Surefire
report directory: <https://builds.apache.org/job/Jena__Development_Test/ws/trunk/jena-arq/target/surefire-reports>

-------------------------------------------------------
 T E S T S
-------------------------------------------------------

[INFO] 
[INFO] --- maven-surefire-plugin:2.12.4:test (default-test) @ jena-arq ---
Running org.apache.jena.atlas.data.TS_Data
java.lang.ExceptionInInitializerError
	at org.apache.jena.riot.RIOT.<clinit>(RIOT.java:38)
	at java.lang.Class.forName0(Native Method)
	at java.lang.Class.forName(Class.java:169)
	at com.hp.hpl.jena.rdf.model.impl.IO_Ctl.callByRefection(IO_Ctl.java:54)
	at com.hp.hpl.jena.rdf.model.impl.IO_Ctl.init(IO_Ctl.java:36)
	at com.hp.hpl.jena.rdf.model.impl.ModelCom.<clinit>(ModelCom.java:63)
	at com.hp.hpl.jena.rdf.model.ModelFactory.createDefaultModel(ModelFactory.java:140)
	at com.hp.hpl.jena.vocabulary.OWL.<clinit>(OWL.java:36)
	at com.hp.hpl.jena.sparql.ARQConstants.<clinit>(ARQConstants.java:44)
	at com.hp.hpl.jena.sparql.sse.SSE.<clinit>(SSE.java:65)
	at org.apache.jena.atlas.data.TestDistinctDataBag.build(TestDistinctDataBag.java:162)
	at org.apache.jena.atlas.data.TestDistinctDataBag.<clinit>(TestDistinctDataBag.java:54)
	at sun.reflect.NativeConstructorAccessorImpl.newInstance0(Native Method)
	at sun.reflect.NativeConstructorAccessorImpl.newInstance(NativeConstructorAccessorImpl.java:39)
	at sun.reflect.DelegatingConstructorAccessorImpl.newInstance(DelegatingConstructorAccessorImpl.java:27)
	at java.lang.reflect.Constructor.newInstance(Constructor.java:513)
	at junit.framework.TestSuite.createTest(TestSuite.java:61)
	at junit.framework.TestSuite.addTestMethod(TestSuite.java:294)
	at junit.framework.TestSuite.addTestsFromTestCase(TestSuite.java:150)
	at junit.framework.TestSuite.<init>(TestSuite.java:129)
	at org.junit.internal.runners.JUnit38ClassRunner.<init>(JUnit38ClassRunner.java:71)
	at org.junit.internal.builders.JUnit3Builder.runnerForClass(JUnit3Builder.java:14)
	at org.junit.runners.model.RunnerBuilder.safeRunnerForClass(RunnerBuilder.java:57)
	at org.junit.internal.builders.AllDefaultPossibilitiesBuilder.runnerForClass(AllDefaultPossibilitiesBuilder.java:29)
	at org.junit.runners.model.RunnerBuilder.safeRunnerForClass(RunnerBuilder.java:57)
	at org.junit.runners.model.RunnerBuilder.runners(RunnerBuilder.java:98)
	at org.junit.runners.model.RunnerBuilder.runners(RunnerBuilder.java:84)
	at org.junit.runners.Suite.<init>(Suite.java:101)
	at org.junit.runners.Suite.<init>(Suite.java:67)
	at sun.reflect.NativeConstructorAccessorImpl.newInstance0(Native Method)
	at sun.reflect.NativeConstructorAccessorImpl.newInstance(NativeConstructorAccessorImpl.java:39)
	at sun.reflect.DelegatingConstructorAccessorImpl.newInstance(DelegatingConstructorAccessorImpl.java:27)
	at java.lang.reflect.Constructor.newInstance(Constructor.java:513)
	at org.junit.internal.builders.AnnotatedBuilder.buildRunner(AnnotatedBuilder.java:35)
	at org.junit.internal.builders.AnnotatedBuilder.runnerForClass(AnnotatedBuilder.java:24)
	at org.junit.runners.model.RunnerBuilder.safeRunnerForClass(RunnerBuilder.java:57)
	at org.junit.internal.builders.AllDefaultPossibilitiesBuilder.runnerForClass(AllDefaultPossibilitiesBuilder.java:29)
	at org.junit.runners.model.RunnerBuilder.safeRunnerForClass(RunnerBuilder.java:57)
	at org.junit.internal.requests.ClassRequest.getRunner(ClassRequest.java:24)
	at org.apache.maven.surefire.junit4.JUnit4Provider.execute(JUnit4Provider.java:250)
	at org.apache.maven.surefire.junit4.JUnit4Provider.executeTestSet(JUnit4Provider.java:141)
	at org.apache.maven.surefire.junit4.JUnit4Provider.invoke(JUnit4Provider.java:112)
	at sun.reflect.NativeMethodAccessorImpl.invoke0(Native Method)
	at sun.reflect.NativeMethodAccessorImpl.invoke(NativeMethodAccessorImpl.java:39)
	at sun.reflect.DelegatingMethodAccessorImpl.invoke(DelegatingMethodAccessorImpl.java:25)
	at java.lang.reflect.Method.invoke(Method.java:597)
	at org.apache.maven.surefire.util.ReflectionUtils.invokeMethodWithArray(ReflectionUtils.java:189)
	at org.apache.maven.surefire.booter.ProviderFactory$ProviderProxy.invoke(ProviderFactory.java:165)
	at org.apache.maven.surefire.booter.ProviderFactory.invokeProvider(ProviderFactory.java:85)
	at org.apache.maven.surefire.booter.ForkedBooter.runSuitesInProcess(ForkedBooter.java:115)
	at org.apache.maven.surefire.booter.ForkedBooter.main(ForkedBooter.java:75)
Caused by: java.lang.NullPointerException
	at org.apache.jena.riot.RIOT.init(RIOT.java:54)
	at com.hp.hpl.jena.query.ARQ.init(ARQ.java:455)
	at com.hp.hpl.jena.query.ARQ.<clinit>(ARQ.java:460)
	... 51 more
****
java.lang.NullPointerException
	at org.apache.jena.riot.RIOT.init(RIOT.java:54)
	at com.hp.hpl.jena.query.ARQ.init(ARQ.java:455)
	at com.hp.hpl.jena.query.ARQ.<clinit>(ARQ.java:460)
	at org.apache.jena.riot.RIOT.<clinit>(RIOT.java:38)
	at java.lang.Class.forName0(Native Method)
	at java.lang.Class.forName(Class.java:169)
	at com.hp.hpl.jena.rdf.model.impl.IO_Ctl.callByRefection(IO_Ctl.java:54)
	at com.hp.hpl.jena.rdf.model.impl.IO_Ctl.init(IO_Ctl.java:36)
	at com.hp.hpl.jena.rdf.model.impl.ModelCom.<clinit>(ModelCom.java:63)
	at com.hp.hpl.jena.rdf.model.ModelFactory.createDefaultModel(ModelFactory.java:140)
	at com.hp.hpl.jena.vocabulary.OWL.<clinit>(OWL.java:36)
	at com.hp.hpl.jena.sparql.ARQConstants.<clinit>(ARQConstants.java:44)
	at com.hp.hpl.jena.sparql.sse.SSE.<clinit>(SSE.java:65)
	at org.apache.jena.atlas.data.TestDistinctDataBag.build(TestDistinctDataBag.java:162)
	at org.apache.jena.atlas.data.TestDistinctDataBag.<clinit>(TestDistinctDataBag.java:54)
	at sun.reflect.NativeConstructorAccessorImpl.newInstance0(Native Method)
	at sun.reflect.NativeConstructorAccessorImpl.newInstance(NativeConstructorAccessorImpl.java:39)
	at sun.reflect.DelegatingConstructorAccessorImpl.newInstance(DelegatingConstructorAccessorImpl.java:27)
	at java.lang.reflect.Constructor.newInstance(Constructor.java:513)
	at junit.framework.TestSuite.createTest(TestSuite.java:61)
	at junit.framework.TestSuite.addTestMethod(TestSuite.java:294)
	at junit.framework.TestSuite.addTestsFromTestCase(TestSuite.java:150)
	at junit.framework.TestSuite.<init>(TestSuite.java:129)
	at org.junit.internal.runners.JUnit38ClassRunner.<init>(JUnit38ClassRunner.java:71)
	at org.junit.internal.builders.JUnit3Builder.runnerForClass(JUnit3Builder.java:14)
	at org.junit.runners.model.RunnerBuilder.safeRunnerForClass(RunnerBuilder.java:57)
	at org.junit.internal.builders.AllDefaultPossibilitiesBuilder.runnerForClass(AllDefaultPossibilitiesBuilder.java:29)
	at org.junit.runners.model.RunnerBuilder.safeRunnerForClass(RunnerBuilder.java:57)
	at org.junit.runners.model.RunnerBuilder.runners(RunnerBuilder.java:98)
	at org.junit.runners.model.RunnerBuilder.runners(RunnerBuilder.java:84)
	at org.junit.runners.Suite.<init>(Suite.java:101)
	at org.junit.runners.Suite.<init>(Suite.java:67)
	at sun.reflect.NativeConstructorAccessorImpl.newInstance0(Native Method)
mojoFailed org.apache.maven.plugins:maven-surefire-plugin:2.12.4(default-test)	at sun.reflect.NativeConstructorAccessorImpl.newInstance(NativeConstructorAccessorImpl.java:39)
	at sun.reflect.DelegatingConstructorAccessorImpl.newInstance(DelegatingConstructorAccessorImpl.java:27)
	at java.lang.reflect.Constructor.newInstance(Constructor.java:513)
	at org.junit.internal.builders.AnnotatedBuilder.buildRunner(AnnotatedBuilder.java:35)
	at org.junit.internal.builders.AnnotatedBuilder.runnerForClass(AnnotatedBuilder.java:24)
	at org.junit.runners.model.RunnerBuilder.safeRunnerForClass(RunnerBuilder.java:57)
	at org.junit.internal.builders.AllDefaultPossibilitiesBuilder.runnerForClass(AllDefaultPossibilitiesBuilder.java:29)
	at org.junit.runners.model.RunnerBuilder.safeRunnerForClass(RunnerBuilder.java:57)
	at org.junit.internal.requests.ClassRequest.getRunner(ClassRequest.java:24)
	at org.apache.maven.surefire.junit4.JUnit4Provider.execute(JUnit4Provider.java:250)
	at org.apache.maven.surefire.junit4.JUnit4Provider.executeTestSet(JUnit4Provider.java:141)
	at org.apache.maven.surefire.junit4.JUnit4Provider.invoke(JUnit4Provider.java:112)
	at sun.reflect.NativeMethodAccessorImpl.invoke0(Native Method)
	at sun.reflect.NativeMethodAccessorImpl.invoke(NativeMethodAccessorImpl.java:39)
	at sun.reflect.DelegatingMethodAccessorImpl.invoke(DelegatingMethodAccessorImpl.java:25)
	at java.lang.reflect.Method.invoke(Method.java:597)
	at org.apache.maven.surefire.util.ReflectionUtils.invokeMethodWithArray(ReflectionUtils.java:189)
	at org.apache.maven.surefire.booter.ProviderFactory$ProviderProxy.invoke(ProviderFactory.java:165)
	at org.apache.maven.surefire.booter.ProviderFactory.invokeProvider(ProviderFactory.java:85)
	at org.apache.maven.surefire.booter.ForkedBooter.runSuitesInProcess(ForkedBooter.java:115)
	at org.apache.maven.surefire.booter.ForkedBooter.main(ForkedBooter.java:75)

Results :

Tests run: 0, Failures: 0, Errors: 0, Skipped: 0


[JENKINS] Recording test results
projectFailed org.apache.jena:jena-arq:2.10.0-SNAPSHOT
sessionEnded
[INFO] ------------------------------------------------------------------------
[INFO] Reactor Summary:
[INFO] 
[INFO] Apache Jena - Parent .............................. SUCCESS [18.632s]
[INFO] Apache Jena - IRI ................................. SUCCESS [17.548s]
[INFO] Apache Jena - CORE API ............................ SUCCESS [55.652s]
[INFO] Apache Jena - ARQ (SPARQL 1.1 Query Engine) ....... FAILURE [12.050s]
[INFO] Apache Jena - TDB (Native Triple Store) ........... SKIPPED
[INFO] Apache Jena - Fuseki (SPARQL 1.1 Server) .......... SKIPPED
[INFO] Apache Jena - Libraries POM ....................... SKIPPED
[INFO] Apache Jena - Distribution ........................ SKIPPED
[INFO] Apache Jena ....................................... SKIPPED
[INFO] ------------------------------------------------------------------------
[INFO] BUILD FAILURE
[INFO] ------------------------------------------------------------------------
[INFO] Total time: 1:46.245s
[INFO] Finished at: Sun Feb 10 19:50:55 UTC 2013
[INFO] Final Memory: 24M/216M
[INFO] ------------------------------------------------------------------------
Projects to build: [MavenProject: org.apache.jena:jena-parent:5-SNAPSHOT @ <https://builds.apache.org/job/Jena__Development_Test/ws/trunk/jena-parent/pom.xml,>
MavenProject: org.apache.jena:jena-iri:0.9.5-SNAPSHOT @ <https://builds.apache.org/job/Jena__Development_Test/ws/trunk/jena-iri/pom.xml,>
MavenProject: org.apache.jena:jena-core:2.10.0-SNAPSHOT @ <https://builds.apache.org/job/Jena__Development_Test/ws/trunk/jena-core/pom.xml,>
MavenProject: org.apache.jena:jena-arq:2.10.0-SNAPSHOT @ <https://builds.apache.org/job/Jena__Development_Test/ws/trunk/jena-arq/pom.xml,>
MavenProject: org.apache.jena:jena-tdb:0.10.0-SNAPSHOT @ <https://builds.apache.org/job/Jena__Development_Test/ws/trunk/jena-tdb/pom.xml,>
MavenProject: org.apache.jena:jena-fuseki:0.2.6-SNAPSHOT @ <https://builds.apache.org/job/Jena__Development_Test/ws/trunk/jena-fuseki/pom.xml,>
MavenProject: org.apache.jena:apache-jena-libs:2.10.0-SNAPSHOT @ <https://builds.apache.org/job/Jena__Development_Test/ws/trunk/apache-jena-libs/pom.xml,>
MavenProject: org.apache.jena:apache-jena:2.10.0-SNAPSHOT @ <https://builds.apache.org/job/Jena__Development_Test/ws/trunk/apache-jena/pom.xml,>
MavenProject: org.apache.jena:jena:2.10.0-SNAPSHOT @ <https://builds.apache.org/job/Jena__Development_Test/ws/trunk/pom.xml]>
[JENKINS] Archiving disabled
[JENKINS] Archiving disabled
[JENKINS] Archiving disabled
[JENKINS] Archiving disabled
[JENKINS] Archiving disabled
[JENKINS] Archiving disabled
[JENKINS] Archiving disabled
[JENKINS] Archiving disabled
[JENKINS] Archiving disabled
Waiting for Jenkins to finish collecting data
mavenExecutionResult exceptions not empty
message : Failed to execute goal org.apache.maven.plugins:maven-surefire-plugin:2.12.4:test
(default-test) on project jena-arq: Execution default-test of goal org.apache.maven.plugins:maven-surefire-plugin:2.12.4:test
failed: The forked VM terminated without saying properly goodbye. VM crash or System.exit
called ?
cause : Execution default-test of goal org.apache.maven.plugins:maven-surefire-plugin:2.12.4:test
failed: The forked VM terminated without saying properly goodbye. VM crash or System.exit
called ?
Stack trace : 
org.apache.maven.lifecycle.LifecycleExecutionException: Failed to execute goal org.apache.maven.plugins:maven-surefire-plugin:2.12.4:test
(default-test) on project jena-arq: Execution default-test of goal org.apache.maven.plugins:maven-surefire-plugin:2.12.4:test
failed: The forked VM terminated without saying properly goodbye. VM crash or System.exit
called ?
	at org.apache.maven.lifecycle.internal.MojoExecutor.execute(MojoExecutor.java:225)
	at org.apache.maven.lifecycle.internal.MojoExecutor.execute(MojoExecutor.java:153)
	at org.apache.maven.lifecycle.internal.MojoExecutor.execute(MojoExecutor.java:145)
	at org.apache.maven.lifecycle.internal.LifecycleModuleBuilder.buildProject(LifecycleModuleBuilder.java:84)
	at org.apache.maven.lifecycle.internal.LifecycleModuleBuilder.buildProject(LifecycleModuleBuilder.java:59)
	at org.apache.maven.lifecycle.internal.LifecycleStarter.singleThreadedBuild(LifecycleStarter.java:183)
	at org.apache.maven.lifecycle.internal.LifecycleStarter.execute(LifecycleStarter.java:161)
	at org.apache.maven.DefaultMaven.doExecute(DefaultMaven.java:320)
	at org.apache.maven.DefaultMaven.execute(DefaultMaven.java:156)
	at org.jvnet.hudson.maven3.launcher.Maven3Launcher.main(Maven3Launcher.java:79)
	at sun.reflect.NativeMethodAccessorImpl.invoke0(Native Method)
	at sun.reflect.NativeMethodAccessorImpl.invoke(NativeMethodAccessorImpl.java:39)
	at sun.reflect.DelegatingMethodAccessorImpl.invoke(DelegatingMethodAccessorImpl.java:25)
	at java.lang.reflect.Method.invoke(Method.java:597)
	at org.codehaus.plexus.classworlds.launcher.Launcher.launchStandard(Launcher.java:329)
	at org.codehaus.plexus.classworlds.launcher.Launcher.launch(Launcher.java:239)
	at org.jvnet.hudson.maven3.agent.Maven3Main.launch(Maven3Main.java:158)
	at hudson.maven.Maven3Builder.call(Maven3Builder.java:100)
	at hudson.maven.Maven3Builder.call(Maven3Builder.java:66)
	at hudson.remoting.UserRequest.perform(UserRequest.java:118)
	at hudson.remoting.UserRequest.perform(UserRequest.java:48)
	at hudson.remoting.Request$2.run(Request.java:326)
	at hudson.remoting.InterceptingExecutorService$1.call(InterceptingExecutorService.java:72)
	at java.util.concurrent.FutureTask$Sync.innerRun(FutureTask.java:303)
	at java.util.concurrent.FutureTask.run(FutureTask.java:138)
	at java.util.concurrent.ThreadPoolExecutor$Worker.runTask(ThreadPoolExecutor.java:886)
	at java.util.concurrent.ThreadPoolExecutor$Worker.run(ThreadPoolExecutor.java:908)
	at java.lang.Thread.run(Thread.java:662)
Caused by: org.apache.maven.plugin.PluginExecutionException: Execution default-test of goal
org.apache.maven.plugins:maven-surefire-plugin:2.12.4:test failed: The forked VM terminated
without saying properly goodbye. VM crash or System.exit called ?
	at org.apache.maven.plugin.DefaultBuildPluginManager.executeMojo(DefaultBuildPluginManager.java:110)
	at org.apache.maven.lifecycle.internal.MojoExecutor.execute(MojoExecutor.java:209)
	... 27 more
Caused by: java.lang.RuntimeException: The forked VM terminated without saying properly goodbye.
VM crash or System.exit called ?
	at org.apache.maven.plugin.surefire.booterclient.output.ForkClient.close(ForkClient.java:257)
	at org.apache.maven.plugin.surefire.booterclient.ForkStarter.fork(ForkStarter.java:301)
	at org.apache.maven.plugin.surefire.booterclient.ForkStarter.run(ForkStarter.java:116)
	at org.apache.maven.plugin.surefire.AbstractSurefireMojo.executeProvider(AbstractSurefireMojo.java:740)
	at org.apache.maven.plugin.surefire.AbstractSurefireMojo.executeAllProviders(AbstractSurefireMojo.java:682)
	at org.apache.maven.plugin.surefire.AbstractSurefireMojo.executeAfterPreconditionsChecked(AbstractSurefireMojo.java:648)
	at org.apache.maven.plugin.surefire.AbstractSurefireMojo.execute(AbstractSurefireMojo.java:586)
	at org.apache.maven.plugin.DefaultBuildPluginManager.executeMojo(DefaultBuildPluginManager.java:101)
	... 28 more
Sending e-mails to: commits@jena.apache.org
channel stopped

Mime
View raw message