jena-commits mailing list archives

Site index · List index
Message view « Date » · « Thread »
Top « Date » · « Thread »
From Apache Jenkins Server <jenk...@builds.apache.org>
Subject Build failed in Jenkins: Jena__Development_Deploy #258
Date Sat, 23 Feb 2013 08:09:43 GMT
See <https://builds.apache.org/job/Jena__Development_Deploy/258/changes>

Changes:

[rvesse] Refactor fix for JENA-399 slightly to provide a single requiresPrepared() method
which checks the prepared state and calls prepare() if necessary

[andy] Correct javadoc.

------------------------------------------
[...truncated 255 lines...]
Uploading: https://repository.apache.org/content/repositories/snapshots/org/apache/jena/jena-core/2.10.1-SNAPSHOT/maven-metadata.xml
Uploaded: https://repository.apache.org/content/repositories/snapshots/org/apache/jena/jena-core/2.10.1-SNAPSHOT/maven-metadata.xml
(2 KB at 4.6 KB/sec)
Uploading: https://repository.apache.org/content/repositories/snapshots/org/apache/jena/jena-core/2.10.1-SNAPSHOT/jena-core-2.10.1-20130223.080745-5-test-sources.jar
Uploaded: https://repository.apache.org/content/repositories/snapshots/org/apache/jena/jena-core/2.10.1-SNAPSHOT/jena-core-2.10.1-20130223.080745-5-test-sources.jar
(685 KB at 878.1 KB/sec)
Uploading: https://repository.apache.org/content/repositories/snapshots/org/apache/jena/jena-core/2.10.1-SNAPSHOT/maven-metadata.xml
Uploaded: https://repository.apache.org/content/repositories/snapshots/org/apache/jena/jena-core/2.10.1-SNAPSHOT/maven-metadata.xml
(2 KB at 4.4 KB/sec)
Uploading: https://repository.apache.org/content/repositories/snapshots/org/apache/jena/jena-core/2.10.1-SNAPSHOT/jena-core-2.10.1-20130223.080745-5-javadoc.jar
Uploaded: https://repository.apache.org/content/repositories/snapshots/org/apache/jena/jena-core/2.10.1-SNAPSHOT/jena-core-2.10.1-20130223.080745-5-javadoc.jar
(2848 KB at 2624.2 KB/sec)
Uploading: https://repository.apache.org/content/repositories/snapshots/org/apache/jena/jena-core/2.10.1-SNAPSHOT/maven-metadata.xml
Uploaded: https://repository.apache.org/content/repositories/snapshots/org/apache/jena/jena-core/2.10.1-SNAPSHOT/maven-metadata.xml
(2 KB at 4.5 KB/sec)
Uploading: https://repository.apache.org/content/repositories/snapshots/org/apache/jena/jena-core/2.10.1-SNAPSHOT/jena-core-2.10.1-20130223.080745-5-tests.jar
Uploaded: https://repository.apache.org/content/repositories/snapshots/org/apache/jena/jena-core/2.10.1-SNAPSHOT/jena-core-2.10.1-20130223.080745-5-tests.jar
(1297 KB at 1423.3 KB/sec)
Uploading: https://repository.apache.org/content/repositories/snapshots/org/apache/jena/jena-core/2.10.1-SNAPSHOT/maven-metadata.xml
Uploaded: https://repository.apache.org/content/repositories/snapshots/org/apache/jena/jena-core/2.10.1-SNAPSHOT/maven-metadata.xml
(2 KB at 3.8 KB/sec)
[INFO]                                                                         
[INFO] ------------------------------------------------------------------------
[INFO] Building Apache Jena - ARQ (SPARQL 1.1 Query Engine) 2.10.1-SNAPSHOT
[INFO] ------------------------------------------------------------------------
[INFO] 
[INFO] --- maven-clean-plugin:2.4.1:clean (default-clean) @ jena-arq ---
[INFO] 
[INFO] --- maven-enforcer-plugin:1.2:enforce (enforce) @ jena-arq ---
[INFO] 
[INFO] --- maven-remote-resources-plugin:1.2.1:process (default) @ jena-arq ---
[INFO] [INFO] Using 'UTF-8' encoding to copy filtered resources.
[INFO] Copying 1 resource to com/hp/hpl/jena/sparql/

[INFO] --- maven-resources-plugin:2.6:resources (default-resources) @ jena-arq ---
[INFO] Copying 3 resources
[INFO] Copying 3 resources
[INFO] 
[INFO] --- maven-compiler-plugin:2.5.1:compile (default-compile) @ jena-arq ---
[INFO] Compiling 1356 source files to <https://builds.apache.org/job/Jena__Development_Deploy/ws/trunk/jena-arq/target/classes>
[INFO] [INFO] Using 'UTF-8' encoding to copy filtered resources.

[INFO] --- maven-resources-plugin:2.6:testResources (default-testResources) @ jena-arq ---
[INFO] Copying 18 resources
[INFO] Copying 3 resources
[INFO] 
[INFO] --- maven-compiler-plugin:2.5.1:testCompile (default-testCompile) @ jena-arq ---
[INFO] Compiling 238 source files to <https://builds.apache.org/job/Jena__Development_Deploy/ws/trunk/jena-arq/target/test-classes>
[INFO] Surefire report directory: <https://builds.apache.org/job/Jena__Development_Deploy/ws/trunk/jena-arq/target/surefire-reports>
[INFO] 
-------------------------------------------------------
 T E S T S
-------------------------------------------------------

[INFO] --- maven-surefire-plugin:2.12.4:test (default-test) @ jena-arq ---
Running org.apache.jena.atlas.io.TS_IO
Tests run: 112, Failures: 0, Errors: 0, Skipped: 0, Time elapsed: 0.226 sec
Running org.apache.jena.atlas.data.TS_Data
Tests run: 12, Failures: 0, Errors: 0, Skipped: 0, Time elapsed: 2.419 sec
Running org.apache.jena.atlas.web.TS_Web
Tests run: 17, Failures: 0, Errors: 0, Skipped: 0, Time elapsed: 0.011 sec
Running org.apache.jena.atlas.iterator.TS_Iterator
Tests run: 70, Failures: 0, Errors: 0, Skipped: 0, Time elapsed: 0.03 sec
Running org.apache.jena.atlas.event.TS_Event
Tests run: 3, Failures: 0, Errors: 0, Skipped: 0, Time elapsed: 0.002 sec
Running org.apache.jena.atlas.lib.TS_Lib
Tests run: 349, Failures: 0, Errors: 0, Skipped: 0, Time elapsed: 0.745 sec
Running org.apache.jena.atlas.json.TS_JSON
Tests run: 27, Failures: 0, Errors: 0, Skipped: 0, Time elapsed: 0.018 sec
Running org.apache.jena.riot.adapters.TS_RIOTAdapters
Tests run: 13, Failures: 0, Errors: 0, Skipped: 0, Time elapsed: 0.052 sec
Running org.apache.jena.riot.system.TS_RiotSystem
Tests run: 124, Failures: 0, Errors: 0, Skipped: 0, Time elapsed: 0.151 sec
Running org.apache.jena.riot.process.TS_Process
Tests run: 60, Failures: 0, Errors: 0, Skipped: 0, Time elapsed: 0.032 sec
Running org.apache.jena.riot.out.TS_Out
Tests run: 102, Failures: 0, Errors: 0, Skipped: 0, Time elapsed: 0.084 sec
Running org.apache.jena.riot.lang.TS_Lang
Tests run: 288, Failures: 0, Errors: 0, Skipped: 0, Time elapsed: 3.883 sec
Running org.apache.jena.riot.stream.TS_IO2
Tests run: 33, Failures: 0, Errors: 0, Skipped: 0, Time elapsed: 0.092 sec
Running org.apache.jena.riot.web.TS_RiotWeb
Tests run: 19, Failures: 0, Errors: 0, Skipped: 0, Time elapsed: 0.003 sec
Running org.apache.jena.riot.TS_LangSuite
Tests run: 259, Failures: 0, Errors: 0, Skipped: 0, Time elapsed: 2.585 sec
Running org.apache.jena.riot.tokens.TS_Tokens
Tests run: 125, Failures: 0, Errors: 0, Skipped: 0, Time elapsed: 0.024 sec
Running org.apache.jena.riot.TS_ReaderRIOT
Tests run: 99, Failures: 0, Errors: 0, Skipped: 0, Time elapsed: 0.121 sec
Running com.hp.hpl.jena.sparql.modify.TS_Update
Tests run: 29, Failures: 0, Errors: 0, Skipped: 0, Time elapsed: 0.525 sec
Running com.hp.hpl.jena.sparql.resultset.TS_ResultSet
Tests run: 121, Failures: 0, Errors: 0, Skipped: 0, Time elapsed: 0.208 sec
Running com.hp.hpl.jena.sparql.syntax.TS_Serialization
Tests run: 42, Failures: 0, Errors: 0, Skipped: 0, Time elapsed: 0.076 sec
Running com.hp.hpl.jena.sparql.syntax.TS_SSE
Tests run: 113, Failures: 0, Errors: 0, Skipped: 0, Time elapsed: 0.033 sec
Running com.hp.hpl.jena.sparql.engine.TS_Engine
Tests run: 33, Failures: 0, Errors: 0, Skipped: 0, Time elapsed: 9.856 sec
Running com.hp.hpl.jena.sparql.engine.binding.TS_Binding
Tests run: 16, Failures: 0, Errors: 0, Skipped: 0, Time elapsed: 0.007 sec
Running com.hp.hpl.jena.sparql.graph.TS_Graph
Tests run: 62, Failures: 0, Errors: 0, Skipped: 0, Time elapsed: 0.065 sec
Running com.hp.hpl.jena.sparql.lang.TS_Lang
Tests run: 53, Failures: 0, Errors: 0, Skipped: 0, Time elapsed: 0.024 sec
Running com.hp.hpl.jena.sparql.expr.TS_Expr
Tests run: 1023, Failures: 0, Errors: 0, Skipped: 0, Time elapsed: 0.402 sec
Running com.hp.hpl.jena.sparql.util.TS_Util
Tests run: 72, Failures: 0, Errors: 0, Skipped: 0, Time elapsed: 0.029 sec
Running com.hp.hpl.jena.sparql.api.TS_API
Tests run: 29, Failures: 0, Errors: 0, Skipped: 0, Time elapsed: 1.947 sec
Running com.hp.hpl.jena.sparql.core.TS_Core
Tests run: 30, Failures: 0, Errors: 0, Skipped: 0, Time elapsed: 0.012 sec
Running com.hp.hpl.jena.sparql.TC_DAWG
Tests run: 467, Failures: 0, Errors: 0, Skipped: 0, Time elapsed: 1.936 sec
Running com.hp.hpl.jena.sparql.function.user.TS_UserFunctions
Tests run: 22, Failures: 0, Errors: 0, Skipped: 0, Time elapsed: 0.01 sec
Running com.hp.hpl.jena.sparql.algebra.TS_Algebra
Tests run: 185, Failures: 0, Errors: 0, Skipped: 0, Time elapsed: 0.144 sec
Running com.hp.hpl.jena.sparql.path.TS_Path
Tests run: 107, Failures: 0, Errors: 0, Skipped: 0, Time elapsed: 0.059 sec
Running com.hp.hpl.jena.sparql.TC_Scripted
Tests run: 992, Failures: 0, Errors: 0, Skipped: 0, Time elapsed: 7.27 sec
Running com.hp.hpl.jena.sparql.solver.TS_Solver
Tests run: 23, Failures: 0, Errors: 0, Skipped: 0, Time elapsed: 0 sec
Running com.hp.hpl.jena.query.TS_ParamString
Tests run: 71, Failures: 0, Errors: 0, Skipped: 0, Time elapsed: 0.022 sec

Results :

Tests run: 5202, Failures: 0, Errors: 0, Skipped: 0

[JENKINS] Recording test results
[INFO] 
[INFO] --- maven-jar-plugin:2.4:jar (default-jar) @ jena-arq ---
[INFO] Building jar: <https://builds.apache.org/job/Jena__Development_Deploy/ws/trunk/jena-arq/target/jena-arq-2.10.1-SNAPSHOT.jar>
[INFO] 
[INFO] --- maven-site-plugin:3.0:attach-descriptor (attach-descriptor) @ jena-arq ---
[INFO] 
[INFO] --- maven-source-plugin:2.2.1:jar-no-fork (attach-sources) @ jena-arq ---
[INFO] Building jar: <https://builds.apache.org/job/Jena__Development_Deploy/ws/trunk/jena-arq/target/jena-arq-2.10.1-SNAPSHOT-sources.jar>
[INFO] 
[INFO] --- maven-source-plugin:2.2.1:test-jar-no-fork (attach-sources-test) @ jena-arq ---
[INFO] Building jar: <https://builds.apache.org/job/Jena__Development_Deploy/ws/trunk/jena-arq/target/jena-arq-2.10.1-SNAPSHOT-test-sources.jar>
[INFO] 
[INFO] Building jar: <https://builds.apache.org/job/Jena__Development_Deploy/ws/trunk/jena-arq/target/jena-arq-2.10.1-SNAPSHOT-tests.jar>
[INFO] --- maven-jar-plugin:2.4:test-jar (default) @ jena-arq ---
[INFO] 
[INFO] --- maven-javadoc-plugin:2.9:jar (attach-javadocs) @ jena-arq ---
[INFO] Building jar: <https://builds.apache.org/job/Jena__Development_Deploy/ws/trunk/jena-arq/target/jena-arq-2.10.1-SNAPSHOT-javadoc.jar>
[INFO] ------------------------------------------------------------------------
[INFO] Reactor Summary:
[INFO] 
[INFO] Apache Jena - Parent .............................. SUCCESS [36.619s]
[INFO] Apache Jena - IRI ................................. SUCCESS [29.890s]
[INFO] Apache Jena - CORE API ............................ SUCCESS [1:28.381s]
[INFO] Apache Jena - ARQ (SPARQL 1.1 Query Engine) ....... FAILURE [1:36.144s]
[INFO] Apache Jena - TDB (Native Triple Store) ........... SKIPPED
[INFO] Apache Jena - Fuseki (SPARQL 1.1 Server) .......... SKIPPED
[INFO] Apache Jena - Libraries POM ....................... SKIPPED
[INFO] Apache Jena - Distribution ........................ SKIPPED
[INFO] Apache Jena ....................................... SKIPPED
[INFO] ------------------------------------------------------------------------
[INFO] BUILD FAILURE
[INFO] ------------------------------------------------------------------------
[INFO] Total time: 4:13.812s
[INFO] Finished at: Sat Feb 23 08:09:30 UTC 2013
[INFO] Final Memory: 34M/194M
[INFO] ------------------------------------------------------------------------
[JENKINS] Archiving disabled
[JENKINS] Archiving disabled
[JENKINS] Archiving disabled
[JENKINS] Archiving disabled
[JENKINS] Archiving disabled
[JENKINS] Archiving disabled
[JENKINS] Archiving disabled
[JENKINS] Archiving disabled
[JENKINS] Archiving disabled
Waiting for Jenkins to finish collecting data
mavenExecutionResult exceptions not empty
message : Internal error: java.lang.reflect.UndeclaredThrowableException
cause : null
Stack trace : 
org.apache.maven.InternalErrorException: Internal error: java.lang.reflect.UndeclaredThrowableException
	at org.apache.maven.lifecycle.internal.BuilderCommon.handleBuildError(BuilderCommon.java:128)
	at org.apache.maven.lifecycle.internal.LifecycleModuleBuilder.buildProject(LifecycleModuleBuilder.java:95)
	at org.apache.maven.lifecycle.internal.LifecycleModuleBuilder.buildProject(LifecycleModuleBuilder.java:59)
	at org.apache.maven.lifecycle.internal.LifecycleStarter.singleThreadedBuild(LifecycleStarter.java:183)
	at org.apache.maven.lifecycle.internal.LifecycleStarter.execute(LifecycleStarter.java:161)
	at org.apache.maven.DefaultMaven.doExecute(DefaultMaven.java:320)
	at org.apache.maven.DefaultMaven.execute(DefaultMaven.java:156)
	at org.jvnet.hudson.maven3.launcher.Maven3Launcher.main(Maven3Launcher.java:79)
	at sun.reflect.NativeMethodAccessorImpl.invoke0(Native Method)
	at sun.reflect.NativeMethodAccessorImpl.invoke(NativeMethodAccessorImpl.java:39)
	at sun.reflect.DelegatingMethodAccessorImpl.invoke(DelegatingMethodAccessorImpl.java:25)
	at java.lang.reflect.Method.invoke(Method.java:597)
	at org.codehaus.plexus.classworlds.launcher.Launcher.launchStandard(Launcher.java:329)
	at org.codehaus.plexus.classworlds.launcher.Launcher.launch(Launcher.java:239)
	at org.jvnet.hudson.maven3.agent.Maven3Main.launch(Maven3Main.java:158)
	at hudson.maven.Maven3Builder.call(Maven3Builder.java:100)
	at hudson.maven.Maven3Builder.call(Maven3Builder.java:66)
	at hudson.remoting.UserRequest.perform(UserRequest.java:118)
	at hudson.remoting.UserRequest.perform(UserRequest.java:48)
	at hudson.remoting.Request$2.run(Request.java:326)
	at hudson.remoting.InterceptingExecutorService$1.call(InterceptingExecutorService.java:72)
	at java.util.concurrent.FutureTask$Sync.innerRun(FutureTask.java:303)
	at java.util.concurrent.FutureTask.run(FutureTask.java:138)
	at java.util.concurrent.ThreadPoolExecutor$Worker.runTask(ThreadPoolExecutor.java:886)
	at java.util.concurrent.ThreadPoolExecutor$Worker.run(ThreadPoolExecutor.java:908)
	at java.lang.Thread.run(Thread.java:662)
Caused by: java.lang.reflect.UndeclaredThrowableException
	at $Proxy2.setExecutedMojos(Unknown Source)
	at hudson.maven.MavenBuildProxy$Filter.setExecutedMojos(MavenBuildProxy.java:243)
	at hudson.maven.Maven3Builder$MavenExecutionListener.recordMojoEnded(Maven3Builder.java:439)
	at hudson.maven.Maven3Builder$MavenExecutionListener.mojoSucceeded(Maven3Builder.java:425)
	at org.apache.maven.lifecycle.internal.DefaultExecutionEventCatapult.fire(DefaultExecutionEventCatapult.java:87)
	at org.apache.maven.lifecycle.internal.DefaultExecutionEventCatapult.fire(DefaultExecutionEventCatapult.java:42)
	at org.apache.maven.lifecycle.internal.MojoExecutor.execute(MojoExecutor.java:228)
	at org.apache.maven.lifecycle.internal.MojoExecutor.execute(MojoExecutor.java:153)
	at org.apache.maven.lifecycle.internal.MojoExecutor.execute(MojoExecutor.java:145)
	at org.apache.maven.lifecycle.internal.LifecycleModuleBuilder.buildProject(LifecycleModuleBuilder.java:84)
	... 24 more
Caused by: java.io.StreamCorruptedException: invalid type code: 40
	at java.io.ObjectInputStream.readObject0(ObjectInputStream.java:1374)
	at java.io.ObjectInputStream.defaultReadFields(ObjectInputStream.java:1970)
	at java.io.ObjectInputStream.readSerialData(ObjectInputStream.java:1894)
	at java.io.ObjectInputStream.readOrdinaryObject(ObjectInputStream.java:1777)
	at java.io.ObjectInputStream.readObject0(ObjectInputStream.java:1347)
	at java.io.ObjectInputStream.readObject(ObjectInputStream.java:369)
	at java.util.concurrent.CopyOnWriteArrayList.readObject(CopyOnWriteArrayList.java:879)
	at sun.reflect.GeneratedMethodAccessor21365.invoke(Unknown Source)
	at sun.reflect.DelegatingMethodAccessorImpl.invoke(DelegatingMethodAccessorImpl.java:43)
	at java.lang.reflect.Method.invoke(Method.java:601)
	at java.io.ObjectStreamClass.invokeReadObject(ObjectStreamClass.java:1004)
	at java.io.ObjectInputStream.readSerialData(ObjectInputStream.java:1872)
	at java.io.ObjectInputStream.readOrdinaryObject(ObjectInputStream.java:1777)
	at java.io.ObjectInputStream.readObject0(ObjectInputStream.java:1347)
	at java.io.ObjectInputStream.readArray(ObjectInputStream.java:1685)
	at java.io.ObjectInputStream.readObject0(ObjectInputStream.java:1341)
	at java.io.ObjectInputStream.defaultReadFields(ObjectInputStream.java:1970)
	at java.io.ObjectInputStream.readSerialData(ObjectInputStream.java:1894)
	at java.io.ObjectInputStream.readOrdinaryObject(ObjectInputStream.java:1777)
	at java.io.ObjectInputStream.readObject0(ObjectInputStream.java:1347)
	at java.io.ObjectInputStream.readObject(ObjectInputStream.java:369)
	at hudson.remoting.UserRequest.deserialize(UserRequest.java:182)
	at hudson.remoting.UserRequest.perform(UserRequest.java:98)
	at hudson.remoting.UserRequest.perform(UserRequest.java:48)
	at hudson.remoting.Request$2.run(Request.java:326)
	at hudson.remoting.InterceptingExecutorService$1.call(InterceptingExecutorService.java:72)
	at java.util.concurrent.FutureTask$Sync.innerRun(FutureTask.java:334)
	at java.util.concurrent.FutureTask.run(FutureTask.java:166)
	at java.util.concurrent.ThreadPoolExecutor.runWorker(ThreadPoolExecutor.java:1145)
	at java.util.concurrent.ThreadPoolExecutor$Worker.run(ThreadPoolExecutor.java:615)
	at java.lang.Thread.run(Thread.java:722)
Sending e-mails to: commits@jena.apache.org
channel stopped

Mime
View raw message