jena-commits mailing list archives

Site index · List index
Message view « Date » · « Thread »
Top « Date » · « Thread »
From Apache Jenkins Server <jenk...@builds.apache.org>
Subject Build failed in Jenkins: Jena__Development_Test » Apache Jena - Fuseki (SPARQL 1.1 Server) #411
Date Thu, 24 Jan 2013 11:07:42 GMT
See <https://builds.apache.org/job/Jena__Development_Test/org.apache.jena$jena-fuseki/411/>

------------------------------------------
projectStarted org.apache.jena:jena-fuseki:0.2.6-SNAPSHOT
[INFO]                                                                         
[INFO] ------------------------------------------------------------------------
[INFO] Building Apache Jena - Fuseki (SPARQL 1.1 Server) 0.2.6-SNAPSHOT
[INFO] ------------------------------------------------------------------------
mojoStarted org.apache.maven.plugins:maven-clean-plugin:2.4.1(default-clean)
[INFO] 
[INFO] --- maven-clean-plugin:2.4.1:clean (default-clean) @ jena-fuseki ---
mojoSucceeded org.apache.maven.plugins:maven-clean-plugin:2.4.1(default-clean)
mojoStarted org.apache.maven.plugins:maven-remote-resources-plugin:1.2.1(default)
[INFO] 
[INFO] --- maven-remote-resources-plugin:1.2.1:process (default) @ jena-fuseki ---
mojoSucceeded org.apache.maven.plugins:maven-remote-resources-plugin:1.2.1(default)
mojoStarted org.apache.maven.plugins:maven-resources-plugin:2.5(default-resources)
[INFO] 
[INFO] --- maven-resources-plugin:2.5:resources (default-resources) @ jena-fuseki ---
[debug] execute contextualize
[INFO] Using 'UTF-8' encoding to copy filtered resources.
[INFO] Copying 1 resource
[INFO] Copying 1 resource
[INFO] Copying 3 resources
mojoSucceeded org.apache.maven.plugins:maven-resources-plugin:2.5(default-resources)
mojoStarted org.apache.maven.plugins:maven-compiler-plugin:2.3.2(default-compile)
[INFO] 
[INFO] --- maven-compiler-plugin:2.3.2:compile (default-compile) @ jena-fuseki ---
[INFO] Compiling 68 source files to <https://builds.apache.org/job/Jena__Development_Test/org.apache.jena$jena-fuseki/ws/target/classes>
[INFO] -------------------------------------------------------------
[ERROR] COMPILATION ERROR : 
[INFO] -------------------------------------------------------------
[ERROR] <https://builds.apache.org/job/Jena__Development_Test/org.apache.jena$jena-fuseki/ws/src/main/java/org/apache/jena/fuseki/migrate/SinkRDFLimited.java>:[23,34]
cannot find symbol
symbol  : class StreamRDFWarpper
location: package org.apache.jena.riot.system
[ERROR] <https://builds.apache.org/job/Jena__Development_Test/org.apache.jena$jena-fuseki/ws/src/main/java/org/apache/jena/fuseki/migrate/SinkRDFLimited.java>:[29,36]
cannot find symbol
symbol: class StreamRDFWarpper
public class SinkRDFLimited extends StreamRDFWarpper
[ERROR] <https://builds.apache.org/job/Jena__Development_Test/org.apache.jena$jena-fuseki/ws/src/main/java/org/apache/jena/fuseki/migrate/GraphLoadUtils.java>:[74,15]
incompatible types
found   : org.apache.jena.fuseki.migrate.SinkRDFLimited
required: org.apache.jena.riot.system.StreamRDF
[ERROR] <https://builds.apache.org/job/Jena__Development_Test/org.apache.jena$jena-fuseki/ws/src/main/java/org/apache/jena/fuseki/migrate/SinkRDFLimited.java>:[44,8]
cannot find symbol
symbol  : variable super
location: class org.apache.jena.fuseki.migrate.SinkRDFLimited
[ERROR] <https://builds.apache.org/job/Jena__Development_Test/org.apache.jena$jena-fuseki/ws/src/main/java/org/apache/jena/fuseki/migrate/SinkRDFLimited.java>:[40,4]
method does not override or implement a method from a supertype
[ERROR] <https://builds.apache.org/job/Jena__Development_Test/org.apache.jena$jena-fuseki/ws/src/main/java/org/apache/jena/fuseki/migrate/SinkRDFLimited.java>:[51,8]
cannot find symbol
symbol  : variable super
location: class org.apache.jena.fuseki.migrate.SinkRDFLimited
[ERROR] <https://builds.apache.org/job/Jena__Development_Test/org.apache.jena$jena-fuseki/ws/src/main/java/org/apache/jena/fuseki/migrate/SinkRDFLimited.java>:[47,4]
method does not override or implement a method from a supertype
[ERROR] <https://builds.apache.org/job/Jena__Development_Test/org.apache.jena$jena-fuseki/ws/src/main/java/org/apache/jena/fuseki/migrate/SinkRDFLimited.java>:[58,8]
cannot find symbol
symbol  : variable super
location: class org.apache.jena.fuseki.migrate.SinkRDFLimited
[ERROR] <https://builds.apache.org/job/Jena__Development_Test/org.apache.jena$jena-fuseki/ws/src/main/java/org/apache/jena/fuseki/migrate/SinkRDFLimited.java>:[54,4]
method does not override or implement a method from a supertype
[INFO] 9 errors 
[INFO] -------------------------------------------------------------
mojoFailed org.apache.maven.plugins:maven-compiler-plugin:2.3.2(default-compile)
projectFailed org.apache.jena:jena-fuseki:0.2.6-SNAPSHOT

Mime
View raw message