jena-commits mailing list archives

Site index · List index
Message view « Date » · « Thread »
Top « Date » · « Thread »
From Apache Jenkins Server <jenk...@builds.apache.org>
Subject Build failed in Jenkins: Jena__Development_Test » Apache Jena - TDB (Native Triple Store) #364
Date Sat, 29 Dec 2012 19:37:31 GMT
See <https://builds.apache.org/job/Jena__Development_Test/org.apache.jena$jena-tdb/364/>

------------------------------------------
projectStarted org.apache.jena:jena-tdb:0.10.0-SNAPSHOT
[INFO]                                                                         
[INFO] ------------------------------------------------------------------------
[INFO] Building Apache Jena - TDB (Native Triple Store) 0.10.0-SNAPSHOT
[INFO] ------------------------------------------------------------------------
mojoStarted org.apache.maven.plugins:maven-clean-plugin:2.4.1(default-clean)
[INFO] 
[INFO] --- maven-clean-plugin:2.4.1:clean (default-clean) @ jena-tdb ---
mojoSucceeded org.apache.maven.plugins:maven-clean-plugin:2.4.1(default-clean)
mojoStarted org.apache.maven.plugins:maven-remote-resources-plugin:1.2.1(default)
[INFO] 
[INFO] --- maven-remote-resources-plugin:1.2.1:process (default) @ jena-tdb ---
mojoSucceeded org.apache.maven.plugins:maven-remote-resources-plugin:1.2.1(default)
mojoStarted org.apache.maven.plugins:maven-resources-plugin:2.6(default-resources)[INFO] Using
'UTF-8' encoding to copy filtered resources.

[INFO] 
[INFO] --- maven-resources-plugin:2.6:resources (default-resources) @ jena-tdb ---
[INFO] Copying 0 resource
[INFO] Copying 1 resource
[INFO] Copying 3 resources
mojoSucceeded org.apache.maven.plugins:maven-resources-plugin:2.6(default-resources)
mojoStarted org.apache.maven.plugins:maven-compiler-plugin:2.5.1(default-compile)
[INFO] 
[INFO] --- maven-compiler-plugin:2.5.1:compile (default-compile) @ jena-tdb ---
[INFO] Compiling 262 source files to <https://builds.apache.org/job/Jena__Development_Test/org.apache.jena$jena-tdb/ws/target/classes>
[INFO] -------------------------------------------------------------
[ERROR] COMPILATION ERROR : 
[INFO] -------------------------------------------------------------
[ERROR] <https://builds.apache.org/job/Jena__Development_Test/org.apache.jena$jena-tdb/ws/src/main/java/com/hp/hpl/jena/tdb/store/bulkloader/BulkSinkRDF.java>:[21,34]
cannot find symbol
symbol  : class SinkRDF
location: package org.apache.jena.riot.system
[ERROR] <https://builds.apache.org/job/Jena__Development_Test/org.apache.jena$jena-tdb/ws/src/main/java/com/hp/hpl/jena/tdb/store/bulkloader/BulkSinkRDF.java>:[23,37]
cannot find symbol
symbol: class SinkRDF
public interface BulkSinkRDF extends SinkRDF
mojoFailed org.apache.maven.plugins:maven-compiler-plugin:2.5.1(default-compile)[ERROR] <https://builds.apache.org/job/Jena__Development_Test/org.apache.jena$jena-tdb/ws/src/main/java/com/hp/hpl/jena/tdb/store/bulkloader/BulkLoader.java>:[139,22]
cannot find symbol
symbol  : method parse(java.lang.String,com.hp.hpl.jena.tdb.store.bulkloader.BulkSinkRDF)
location: class org.apache.jena.riot.RiotReader
[ERROR] <https://builds.apache.org/job/Jena__Development_Test/org.apache.jena$jena-tdb/ws/src/main/java/com/hp/hpl/jena/tdb/store/bulkloader/BulkLoader.java>:[149,18]
cannot find symbol
symbol  : method parse(java.io.InputStream,org.apache.jena.riot.Lang,<nulltype>,com.hp.hpl.jena.tdb.store.bulkloader.BulkSinkRDF)
location: class org.apache.jena.riot.RiotReader
[ERROR] <https://builds.apache.org/job/Jena__Development_Test/org.apache.jena$jena-tdb/ws/src/main/java/com/hp/hpl/jena/tdb/store/bulkloader/BulkLoader.java>:[160,22]
cannot find symbol
symbol  : method parse(java.lang.String,com.hp.hpl.jena.tdb.store.bulkloader.BulkSinkRDF)
location: class org.apache.jena.riot.RiotReader
[ERROR] <https://builds.apache.org/job/Jena__Development_Test/org.apache.jena$jena-tdb/ws/src/main/java/com/hp/hpl/jena/tdb/store/bulkloader/BulkLoader.java>:[170,18]
cannot find symbol
symbol  : method parse(java.io.InputStream,org.apache.jena.riot.Lang,<nulltype>,com.hp.hpl.jena.tdb.store.bulkloader.BulkSinkRDF)
location: class org.apache.jena.riot.RiotReader

[ERROR] <https://builds.apache.org/job/Jena__Development_Test/org.apache.jena$jena-tdb/ws/src/main/java/com/hp/hpl/jena/tdb/store/bulkloader/BulkLoader.java>:[238,8]
method does not override or implement a method from a supertype
[ERROR] <https://builds.apache.org/job/Jena__Development_Test/org.apache.jena$jena-tdb/ws/src/main/java/com/hp/hpl/jena/tdb/store/bulkloader/BulkLoader.java>:[247,8]
method does not override or implement a method from a supertype
[ERROR] <https://builds.apache.org/job/Jena__Development_Test/org.apache.jena$jena-tdb/ws/src/main/java/com/hp/hpl/jena/tdb/store/bulkloader/BulkLoader.java>:[292,8]
method does not override or implement a method from a supertype
[ERROR] <https://builds.apache.org/job/Jena__Development_Test/org.apache.jena$jena-tdb/ws/src/main/java/com/hp/hpl/jena/tdb/store/bulkloader/BulkLoader.java>:[294,8]
method does not override or implement a method from a supertype
[ERROR] <https://builds.apache.org/job/Jena__Development_Test/org.apache.jena$jena-tdb/ws/src/main/java/com/hp/hpl/jena/tdb/store/bulkloader/BulkLoader.java>:[296,8]
method does not override or implement a method from a supertype
[ERROR] <https://builds.apache.org/job/Jena__Development_Test/org.apache.jena$jena-tdb/ws/src/main/java/com/hp/hpl/jena/tdb/store/bulkloader/BulkLoader.java>:[298,8]
method does not override or implement a method from a supertype
[ERROR] <https://builds.apache.org/job/Jena__Development_Test/org.apache.jena$jena-tdb/ws/src/main/java/com/hp/hpl/jena/tdb/store/bulkloader/BulkLoader.java>:[300,8]
method does not override or implement a method from a supertype
[ERROR] <https://builds.apache.org/job/Jena__Development_Test/org.apache.jena$jena-tdb/ws/src/main/java/com/hp/hpl/jena/tdb/store/bulkloader/BulkLoader.java>:[330,8]
method does not override or implement a method from a supertype
[ERROR] <https://builds.apache.org/job/Jena__Development_Test/org.apache.jena$jena-tdb/ws/src/main/java/com/hp/hpl/jena/tdb/store/bulkloader/BulkLoader.java>:[358,8]
method does not override or implement a method from a supertype
[ERROR] <https://builds.apache.org/job/Jena__Development_Test/org.apache.jena$jena-tdb/ws/src/main/java/com/hp/hpl/jena/tdb/store/bulkloader/BulkLoader.java>:[360,8]
method does not override or implement a method from a supertype
[ERROR] <https://builds.apache.org/job/Jena__Development_Test/org.apache.jena$jena-tdb/ws/src/main/java/com/hp/hpl/jena/tdb/store/bulkloader/BulkLoader.java>:[362,8]
method does not override or implement a method from a supertype
[ERROR] <https://builds.apache.org/job/Jena__Development_Test/org.apache.jena$jena-tdb/ws/src/main/java/com/hp/hpl/jena/tdb/store/bulkloader/BulkLoader.java>:[364,8]
method does not override or implement a method from a supertype
[ERROR] <https://builds.apache.org/job/Jena__Development_Test/org.apache.jena$jena-tdb/ws/src/main/java/com/hp/hpl/jena/tdb/store/bulkloader/BulkLoader.java>:[366,8]
method does not override or implement a method from a supertype
[ERROR] <https://builds.apache.org/job/Jena__Development_Test/org.apache.jena$jena-tdb/ws/src/main/java/com/hp/hpl/jena/tdb/store/bulkloader/BulkLoader.java>:[368,8]
method does not override or implement a method from a supertype
[ERROR] <https://builds.apache.org/job/Jena__Development_Test/org.apache.jena$jena-tdb/ws/src/main/java/com/hp/hpl/jena/tdb/store/bulkloader2/CmdNodeTableBuilder.java>:[162,22]
cannot find symbol
symbol  : method parse(java.lang.String,com.hp.hpl.jena.tdb.store.bulkloader2.CmdNodeTableBuilder.NodeTableBuilder)
location: class org.apache.jena.riot.RiotReader
[ERROR] <https://builds.apache.org/job/Jena__Development_Test/org.apache.jena$jena-tdb/ws/src/main/java/com/hp/hpl/jena/tdb/store/bulkloader2/CmdNodeTableBuilder.java>:[208,8]
method does not override or implement a method from a supertype
[ERROR] <https://builds.apache.org/job/Jena__Development_Test/org.apache.jena$jena-tdb/ws/src/main/java/com/hp/hpl/jena/tdb/store/bulkloader2/CmdNodeTableBuilder.java>:[212,8]
method does not override or implement a method from a supertype
[ERROR] <https://builds.apache.org/job/Jena__Development_Test/org.apache.jena$jena-tdb/ws/src/main/java/com/hp/hpl/jena/tdb/store/bulkloader2/CmdNodeTableBuilder.java>:[224,8]
method does not override or implement a method from a supertype
[ERROR] <https://builds.apache.org/job/Jena__Development_Test/org.apache.jena$jena-tdb/ws/src/main/java/com/hp/hpl/jena/tdb/store/bulkloader2/CmdNodeTableBuilder.java>:[233,8]
method does not override or implement a method from a supertype
[ERROR] <https://builds.apache.org/job/Jena__Development_Test/org.apache.jena$jena-tdb/ws/src/main/java/com/hp/hpl/jena/tdb/store/bulkloader2/CmdNodeTableBuilder.java>:[276,8]
method does not override or implement a method from a supertype
[ERROR] <https://builds.apache.org/job/Jena__Development_Test/org.apache.jena$jena-tdb/ws/src/main/java/com/hp/hpl/jena/tdb/store/bulkloader2/CmdNodeTableBuilder.java>:[280,8]
method does not override or implement a method from a supertype
[ERROR] <https://builds.apache.org/job/Jena__Development_Test/org.apache.jena$jena-tdb/ws/src/main/java/com/hp/hpl/jena/tdb/store/bulkloader2/CmdNodeTableBuilder.java>:[284,8]
method does not override or implement a method from a supertype
[INFO] 28 errors 
[INFO] -------------------------------------------------------------
projectFailed org.apache.jena:jena-tdb:0.10.0-SNAPSHOT

Mime
View raw message