jena-commits mailing list archives

Site index · List index
Message view « Date » · « Thread »
Top « Date » · « Thread »
From Apache Jenkins Server <jenk...@builds.apache.org>
Subject Build failed in Jenkins: Jena__Development_Test #285
Date Tue, 20 Nov 2012 17:15:50 GMT
See <https://builds.apache.org/job/Jena__Development_Test/285/changes>

Changes:

[andy] Correct error used when no request parameter

[andy] Maybe handle XML MIME types as RDF/XML.

[andy] Maybe handle XML MIME types as RDF/XML.

------------------------------------------
[...truncated 242 lines...]
Tests run: 17, Failures: 0, Errors: 0, Skipped: 0, Time elapsed: 0.005 sec
Running org.openjena.atlas.data.TS_Data
Tests run: 12, Failures: 0, Errors: 0, Skipped: 0, Time elapsed: 3.296 sec
Running org.openjena.atlas.event.TS_Event
Tests run: 3, Failures: 0, Errors: 0, Skipped: 0, Time elapsed: 0 sec
Running org.openjena.atlas.iterator.TS_Iterator
Tests run: 70, Failures: 0, Errors: 0, Skipped: 0, Time elapsed: 0.021 sec
Running com.hp.hpl.jena.query.TS_ParamString
Tests run: 71, Failures: 0, Errors: 0, Skipped: 0, Time elapsed: 0.071 sec
Running com.hp.hpl.jena.sparql.function.user.TS_UserFunctions
Tests run: 22, Failures: 0, Errors: 0, Skipped: 0, Time elapsed: 0.066 sec
Running com.hp.hpl.jena.sparql.TC_Scripted
Tests run: 992, Failures: 0, Errors: 0, Skipped: 0, Time elapsed: 6.24 sec
Running com.hp.hpl.jena.sparql.api.TS_API
Tests run: 29, Failures: 0, Errors: 0, Skipped: 0, Time elapsed: 1.923 sec
Running com.hp.hpl.jena.sparql.lang.TS_Lang
Tests run: 53, Failures: 0, Errors: 0, Skipped: 0, Time elapsed: 0.018 sec
Running com.hp.hpl.jena.sparql.graph.TS_Graph
Tests run: 105, Failures: 0, Errors: 0, Skipped: 0, Time elapsed: 0.103 sec
Running com.hp.hpl.jena.sparql.modify.TS_Update
Tests run: 32, Failures: 0, Errors: 0, Skipped: 0, Time elapsed: 0.062 sec
Running com.hp.hpl.jena.sparql.core.TS_Core
Tests run: 42, Failures: 0, Errors: 0, Skipped: 0, Time elapsed: 0.016 sec
Running com.hp.hpl.jena.sparql.expr.TS_Expr
Tests run: 1023, Failures: 0, Errors: 0, Skipped: 0, Time elapsed: 0.369 sec
Running com.hp.hpl.jena.sparql.engine.TS_Engine
Tests run: 25, Failures: 0, Errors: 0, Skipped: 0, Time elapsed: 0.292 sec
Running com.hp.hpl.jena.sparql.engine.binding.TS_Binding
Tests run: 16, Failures: 0, Errors: 0, Skipped: 0, Time elapsed: 0.005 sec
Running com.hp.hpl.jena.sparql.solver.TS_Solver
Tests run: 23, Failures: 0, Errors: 0, Skipped: 0, Time elapsed: 0.013 sec
Running com.hp.hpl.jena.sparql.resultset.TS_ResultSet
Tests run: 121, Failures: 0, Errors: 0, Skipped: 0, Time elapsed: 0.137 sec
Running com.hp.hpl.jena.sparql.util.TS_Util
Tests run: 72, Failures: 0, Errors: 0, Skipped: 0, Time elapsed: 0.032 sec
Running com.hp.hpl.jena.sparql.path.TS_Path
Tests run: 109, Failures: 0, Errors: 0, Skipped: 7, Time elapsed: 0.057 sec
Running com.hp.hpl.jena.sparql.algebra.TS_Algebra
Tests run: 177, Failures: 0, Errors: 0, Skipped: 0, Time elapsed: 0.11 sec
Running com.hp.hpl.jena.sparql.TC_DAWG
Tests run: 467, Failures: 0, Errors: 0, Skipped: 0, Time elapsed: 2.673 sec
Running com.hp.hpl.jena.sparql.syntax.TS_Serialization
Tests run: 42, Failures: 0, Errors: 0, Skipped: 0, Time elapsed: 0.009 sec
Running com.hp.hpl.jena.sparql.syntax.TS_SSE
Tests run: 113, Failures: 0, Errors: 0, Skipped: 0, Time elapsed: 0.025 sec

Results :

Tests run: 5046, Failures: 0, Errors: 0, Skipped: 7

mojoSucceeded org.apache.maven.plugins:maven-surefire-plugin:2.12.4(default-test)
[JENKINS] Recording test results
projectSucceeded org.apache.jena:jena-arq:2.9.5-SNAPSHOT
projectStarted org.apache.jena:jena-tdb:0.9.5-SNAPSHOT
[INFO]                                                                         
[INFO] ------------------------------------------------------------------------
[INFO] Building Apache Jena - TDB (Native Triple Store) 0.9.5-SNAPSHOT
[INFO] ------------------------------------------------------------------------
mojoStarted org.apache.maven.plugins:maven-clean-plugin:2.4.1(default-clean)
[INFO] 
[INFO] --- maven-clean-plugin:2.4.1:clean (default-clean) @ jena-tdb ---
mojoSucceeded org.apache.maven.plugins:maven-clean-plugin:2.4.1(default-clean)
mojoStarted org.apache.maven.plugins:maven-remote-resources-plugin:1.2.1(default)
[INFO] 
[INFO] --- maven-remote-resources-plugin:1.2.1:process (default) @ jena-tdb ---
mojoSucceeded org.apache.maven.plugins:maven-remote-resources-plugin:1.2.1(default)
mojoStarted org.apache.maven.plugins:maven-resources-plugin:2.6(default-resources)[INFO] Using
'UTF-8' encoding to copy filtered resources.

[INFO] 
[INFO] --- maven-resources-plugin:2.6:resources (default-resources) @ jena-tdb ---
[INFO] Copying 0 resource
[INFO] Copying 1 resource
[INFO] Copying 3 resources
mojoSucceeded org.apache.maven.plugins:maven-resources-plugin:2.6(default-resources)
mojoStarted org.apache.maven.plugins:maven-compiler-plugin:2.5.1(default-compile)
[INFO] 
[INFO] --- maven-compiler-plugin:2.5.1:compile (default-compile) @ jena-tdb ---
[INFO] Compiling 262 source files to <https://builds.apache.org/job/Jena__Development_Test/ws/trunk/jena-tdb/target/classes>
mojoSucceeded org.apache.maven.plugins:maven-compiler-plugin:2.5.1(default-compile)
mojoStarted org.apache.maven.plugins:maven-resources-plugin:2.6(default-testResources)[INFO]
Using 'UTF-8' encoding to copy filtered resources.
[INFO] Copying 0 resource
[INFO] Copying 3 resources

[INFO] 
[INFO] --- maven-resources-plugin:2.6:testResources (default-testResources) @ jena-tdb ---
mojoSucceeded org.apache.maven.plugins:maven-resources-plugin:2.6(default-testResources)
mojoStarted org.apache.maven.plugins:maven-compiler-plugin:2.5.1(default-testCompile)
[INFO] 
[INFO] --- maven-compiler-plugin:2.5.1:testCompile (default-testCompile) @ jena-tdb ---
[INFO] Compiling 129 source files to <https://builds.apache.org/job/Jena__Development_Test/ws/trunk/jena-tdb/target/test-classes>
mojoSucceeded org.apache.maven.plugins:maven-compiler-plugin:2.5.1(default-testCompile)
[INFO] Surefire report directory: <https://builds.apache.org/job/Jena__Development_Test/ws/trunk/jena-tdb/target/surefire-reports>
mojoStarted org.apache.maven.plugins:maven-surefire-plugin:2.12.4(default-test)
-------------------------------------------------------
 T E S T S
-------------------------------------------------------

[INFO] 
[INFO] --- maven-surefire-plugin:2.12.4:test (default-test) @ jena-tdb ---
Running com.hp.hpl.jena.tdb.transaction.TS_Transaction
Tests run: 129, Failures: 0, Errors: 0, Skipped: 0, Time elapsed: 51.295 sec
Running com.hp.hpl.jena.tdb.sys.TS_Sys
Tests run: 1, Failures: 0, Errors: 0, Skipped: 0, Time elapsed: 0 sec
Running com.hp.hpl.jena.tdb.base.objectfile.TS_ObjectFile
Tests run: 40, Failures: 0, Errors: 0, Skipped: 0, Time elapsed: 0.194 sec
Running com.hp.hpl.jena.tdb.base.record.TS_Record
Tests run: 54, Failures: 0, Errors: 0, Skipped: 0, Time elapsed: 0.018 sec
Running com.hp.hpl.jena.tdb.base.file.TS_File
Tests run: 39, Failures: 0, Errors: 0, Skipped: 0, Time elapsed: 0.207 sec
Running com.hp.hpl.jena.tdb.base.recordfile.TS_RecordFile
Tests run: 2, Failures: 0, Errors: 0, Skipped: 0, Time elapsed: 0.001 sec
Running com.hp.hpl.jena.tdb.base.block.TS_Block
Tests run: 18, Failures: 0, Errors: 0, Skipped: 0, Time elapsed: 0.263 sec
Running com.hp.hpl.jena.tdb.lib.TS_LibTDB
Tests run: 9, Failures: 0, Errors: 0, Skipped: 0, Time elapsed: 0.006 sec
Running com.hp.hpl.jena.tdb.graph.TS_Graph
Tests run: 67, Failures: 0, Errors: 0, Skipped: 4, Time elapsed: 1.053 sec
Running com.hp.hpl.jena.tdb.index.TS_Index
Tests run: 97, Failures: 0, Errors: 0, Skipped: 0, Time elapsed: 0.423 sec
Running com.hp.hpl.jena.tdb.solver.TS_SolverTDB
Tests run: 6, Failures: 0, Errors: 0, Skipped: 0, Time elapsed: 0.072 sec
Running com.hp.hpl.jena.tdb.TS_Factory
Tests run: 5, Failures: 0, Errors: 0, Skipped: 0, Time elapsed: 0.522 sec
Running com.hp.hpl.jena.tdb.store.TS_Store
Wrong mode
Tests run: 194, Failures: 0, Errors: 0, Skipped: 0, Time elapsed: 15.925 sec
Running com.hp.hpl.jena.tdb.TS_Jena
Tests run: 73, Failures: 0, Errors: 0, Skipped: 0, Time elapsed: 0.15 sec
Running com.hp.hpl.jena.tdb.nodetable.TS_NodeTable
Tests run: 44, Failures: 0, Errors: 0, Skipped: 0, Time elapsed: 0.019 sec
Running com.hp.hpl.jena.tdb.assembler.TS_TDBAssembler
Tests run: 7, Failures: 0, Errors: 0, Skipped: 0, Time elapsed: 1.794 sec

Results :

Tests run: 785, Failures: 0, Errors: 0, Skipped: 4

mojoSucceeded org.apache.maven.plugins:maven-surefire-plugin:2.12.4(default-test)
[JENKINS] Recording test results
projectSucceeded org.apache.jena:jena-tdb:0.9.5-SNAPSHOT
projectStarted org.apache.jena:jena-fuseki:0.2.6-SNAPSHOT
[INFO]                                                                         
[INFO] ------------------------------------------------------------------------
[INFO] Building Apache Jena - Fuseki (SPARQL 1.1 Server) 0.2.6-SNAPSHOT
[INFO] ------------------------------------------------------------------------
mojoStarted org.apache.maven.plugins:maven-clean-plugin:2.4.1(default-clean)
[INFO] 
[INFO] --- maven-clean-plugin:2.4.1:clean (default-clean) @ jena-fuseki ---
mojoSucceeded org.apache.maven.plugins:maven-clean-plugin:2.4.1(default-clean)
mojoStarted org.apache.maven.plugins:maven-remote-resources-plugin:1.2.1(default)
[INFO] 
[INFO] --- maven-remote-resources-plugin:1.2.1:process (default) @ jena-fuseki ---
mojoSucceeded org.apache.maven.plugins:maven-remote-resources-plugin:1.2.1(default)
mojoStarted org.apache.maven.plugins:maven-resources-plugin:2.5(default-resources)[debug]
execute contextualize

[INFO] 
[INFO] --- maven-resources-plugin:2.5:resources (default-resources) @ jena-fuseki ---
[INFO] Using 'UTF-8' encoding to copy filtered resources.
[INFO] Copying 1 resource
[INFO] Copying 1 resource
[INFO] Copying 3 resources
mojoSucceeded org.apache.maven.plugins:maven-resources-plugin:2.5(default-resources)
mojoStarted org.apache.maven.plugins:maven-compiler-plugin:2.3.2(default-compile)
[INFO] 
[INFO] --- maven-compiler-plugin:2.3.2:compile (default-compile) @ jena-fuseki ---
[INFO] Compiling 67 source files to <https://builds.apache.org/job/Jena__Development_Test/ws/trunk/jena-fuseki/target/classes>
[INFO] -------------------------------------------------------------
[ERROR] COMPILATION ERROR : 
[INFO] -------------------------------------------------------------
[ERROR] <https://builds.apache.org/job/Jena__Development_Test/ws/trunk/jena-fuseki/src/main/java/org/apache/jena/fuseki/servlets/ResponseResultSet.java>:[119,36]
cannot find symbol
symbol  : variable contentTypeXML
location: class org.openjena.riot.WebContent
[ERROR] <https://builds.apache.org/job/Jena__Development_Test/ws/trunk/jena-fuseki/src/main/java/org/apache/jena/fuseki/servlets/ResponseResultSet.java>:[282,44]
cannot find symbol
symbol  : variable contentTypeXML
location: class org.openjena.riot.WebContent
[INFO] 2 errors 
[INFO] -------------------------------------------------------------
mojoFailed org.apache.maven.plugins:maven-compiler-plugin:2.3.2(default-compile)
projectFailed org.apache.jena:jena-fuseki:0.2.6-SNAPSHOT
sessionEnded
[INFO] ------------------------------------------------------------------------
[INFO] Reactor Summary:
[INFO] 
[INFO] Apache Jena - Parent .............................. SUCCESS [27.407s]
[INFO] Apache Jena - IRI ................................. SUCCESS [19.090s]
[INFO] Apache Jena - CORE API ............................ SUCCESS [1:00.267s]
[INFO] Apache Jena - ARQ (SPARQL 1.1 Query Engine) ....... SUCCESS [43.135s]
[INFO] Apache Jena - TDB (Native Triple Store) ........... SUCCESS [1:21.429s]
[INFO] Apache Jena - Fuseki (SPARQL 1.1 Server) .......... FAILURE [4.263s]
[INFO] Apache Jena - Distribution ........................ SKIPPED
[INFO] Apache Jena ....................................... SKIPPED
[INFO] ------------------------------------------------------------------------
[INFO] BUILD FAILURE
[INFO] ------------------------------------------------------------------------
[INFO] Total time: 3:58.943s
[INFO] Finished at: Tue Nov 20 17:15:42 UTC 2012
[INFO] Final Memory: 30M/201M
[INFO] ------------------------------------------------------------------------
Projects to build: [MavenProject: org.apache.jena:jena-parent:5-SNAPSHOT @ <https://builds.apache.org/job/Jena__Development_Test/ws/trunk/jena-parent/pom.xml,>
MavenProject: org.apache.jena:jena-iri:0.9.5-SNAPSHOT @ <https://builds.apache.org/job/Jena__Development_Test/ws/trunk/jena-iri/pom.xml,>
MavenProject: org.apache.jena:jena-core:2.7.5-SNAPSHOT @ <https://builds.apache.org/job/Jena__Development_Test/ws/trunk/jena-core/pom.xml,>
MavenProject: org.apache.jena:jena-arq:2.9.5-SNAPSHOT @ <https://builds.apache.org/job/Jena__Development_Test/ws/trunk/jena-arq/pom.xml,>
MavenProject: org.apache.jena:jena-tdb:0.9.5-SNAPSHOT @ <https://builds.apache.org/job/Jena__Development_Test/ws/trunk/jena-tdb/pom.xml,>
MavenProject: org.apache.jena:jena-fuseki:0.2.6-SNAPSHOT @ <https://builds.apache.org/job/Jena__Development_Test/ws/trunk/jena-fuseki/pom.xml,>
MavenProject: org.apache.jena:apache-jena:2.7.5-SNAPSHOT @ <https://builds.apache.org/job/Jena__Development_Test/ws/trunk/apache-jena/pom.xml,>
MavenProject: org.apache.jena:jena:2.7.5-SNAPSHOT @ <https://builds.apache.org/job/Jena__Development_Test/ws/trunk/pom.xml]>
[JENKINS] Archiving disabled - not archiving <https://builds.apache.org/job/Jena__Development_Test/ws/trunk/jena-iri/pom.xml>
[JENKINS] Archiving disabled - not archiving <https://builds.apache.org/job/Jena__Development_Test/ws/trunk/jena-arq/pom.xml>
[JENKINS] Archiving disabled - not archiving <https://builds.apache.org/job/Jena__Development_Test/ws/trunk/jena-parent/pom.xml>
[JENKINS] Archiving disabled - not archiving <https://builds.apache.org/job/Jena__Development_Test/ws/trunk/jena-tdb/pom.xml>
[JENKINS] Archiving disabled - not archiving <https://builds.apache.org/job/Jena__Development_Test/ws/trunk/pom.xml>
[JENKINS] Archiving disabled - not archiving <https://builds.apache.org/job/Jena__Development_Test/ws/trunk/jena-fuseki/pom.xml>
[JENKINS] Archiving disabled - not archiving <https://builds.apache.org/job/Jena__Development_Test/ws/trunk/apache-jena/pom.xml>
[JENKINS] Archiving disabled - not archiving <https://builds.apache.org/job/Jena__Development_Test/ws/trunk/jena-core/pom.xml>
Waiting for Jenkins to finish collecting data
mavenExecutionResult exceptions not empty
message : Failed to execute goal org.apache.maven.plugins:maven-compiler-plugin:2.3.2:compile
(default-compile) on project jena-fuseki: Compilation failure
cause : Compilation failure
Stack trace : 
org.apache.maven.lifecycle.LifecycleExecutionException: Failed to execute goal org.apache.maven.plugins:maven-compiler-plugin:2.3.2:compile
(default-compile) on project jena-fuseki: Compilation failure
	at org.apache.maven.lifecycle.internal.MojoExecutor.execute(MojoExecutor.java:213)
	at org.apache.maven.lifecycle.internal.MojoExecutor.execute(MojoExecutor.java:153)
	at org.apache.maven.lifecycle.internal.MojoExecutor.execute(MojoExecutor.java:145)
	at org.apache.maven.lifecycle.internal.LifecycleModuleBuilder.buildProject(LifecycleModuleBuilder.java:84)
	at org.apache.maven.lifecycle.internal.LifecycleModuleBuilder.buildProject(LifecycleModuleBuilder.java:59)
	at org.apache.maven.lifecycle.internal.LifecycleStarter.singleThreadedBuild(LifecycleStarter.java:183)
	at org.apache.maven.lifecycle.internal.LifecycleStarter.execute(LifecycleStarter.java:161)
	at org.apache.maven.DefaultMaven.doExecute(DefaultMaven.java:319)
	at org.apache.maven.DefaultMaven.execute(DefaultMaven.java:156)
	at org.jvnet.hudson.maven3.launcher.Maven3Launcher.main(Maven3Launcher.java:79)
	at sun.reflect.NativeMethodAccessorImpl.invoke0(Native Method)
	at sun.reflect.NativeMethodAccessorImpl.invoke(NativeMethodAccessorImpl.java:39)
	at sun.reflect.DelegatingMethodAccessorImpl.invoke(DelegatingMethodAccessorImpl.java:25)
	at java.lang.reflect.Method.invoke(Method.java:597)
	at org.codehaus.plexus.classworlds.launcher.Launcher.launchStandard(Launcher.java:329)
	at org.codehaus.plexus.classworlds.launcher.Launcher.launch(Launcher.java:239)
	at org.jvnet.hudson.maven3.agent.Maven3Main.launch(Maven3Main.java:158)
	at hudson.maven.Maven3Builder.call(Maven3Builder.java:98)
	at hudson.maven.Maven3Builder.call(Maven3Builder.java:64)
	at hudson.remoting.UserRequest.perform(UserRequest.java:118)
	at hudson.remoting.UserRequest.perform(UserRequest.java:48)
	at hudson.remoting.Request$2.run(Request.java:326)
	at hudson.remoting.InterceptingExecutorService$1.call(InterceptingExecutorService.java:72)
	at java.util.concurrent.FutureTask$Sync.innerRun(FutureTask.java:303)
	at java.util.concurrent.FutureTask.run(FutureTask.java:138)
	at java.util.concurrent.ThreadPoolExecutor$Worker.runTask(ThreadPoolExecutor.java:886)
	at java.util.concurrent.ThreadPoolExecutor$Worker.run(ThreadPoolExecutor.java:908)
	at java.lang.Thread.run(Thread.java:662)
Caused by: org.apache.maven.plugin.CompilationFailureException: Compilation failure
	at org.apache.maven.plugin.AbstractCompilerMojo.execute(AbstractCompilerMojo.java:656)
	at org.apache.maven.plugin.CompilerMojo.execute(CompilerMojo.java:128)
	at org.apache.maven.plugin.DefaultBuildPluginManager.executeMojo(DefaultBuildPluginManager.java:101)
	at org.apache.maven.lifecycle.internal.MojoExecutor.execute(MojoExecutor.java:209)
	... 27 more
Sending e-mails to: commits@jena.apache.org
channel stopped

Mime
View raw message