jena-commits mailing list archives

Site index · List index
Message view « Date » · « Thread »
Top « Date » · « Thread »
From Apache Jenkins Server <jenk...@builds.apache.org>
Subject Build failed in Jenkins: Jena__Development_Test #101
Date Wed, 29 Aug 2012 11:46:57 GMT
See <https://builds.apache.org/job/Jena__Development_Test/101/changes>

Changes:

[andy] Tidy up general SPARQL request dispatch.
Add direct naming support to SPARQL_REST_* servlets.

------------------------------------------
[...truncated 244 lines...]
Running org.openjena.atlas.iterator.TS_Iterator
Tests run: 70, Failures: 0, Errors: 0, Skipped: 0, Time elapsed: 0.024 sec
Running com.hp.hpl.jena.query.TS_ParamString
Tests run: 71, Failures: 0, Errors: 0, Skipped: 0, Time elapsed: 0.075 sec
Running com.hp.hpl.jena.sparql.TC_Scripted
Tests run: 839, Failures: 0, Errors: 0, Skipped: 0, Time elapsed: 6.009 sec
Running com.hp.hpl.jena.sparql.api.TS_API
Tests run: 27, Failures: 0, Errors: 0, Skipped: 0, Time elapsed: 1.936 sec
Running com.hp.hpl.jena.sparql.lang.TS_Lang
Tests run: 53, Failures: 0, Errors: 0, Skipped: 0, Time elapsed: 0.024 sec
Running com.hp.hpl.jena.sparql.graph.TS_Graph
Tests run: 88, Failures: 0, Errors: 0, Skipped: 0, Time elapsed: 0.082 sec
Running com.hp.hpl.jena.sparql.modify.TS_Update
Tests run: 32, Failures: 0, Errors: 0, Skipped: 0, Time elapsed: 0.098 sec
Running com.hp.hpl.jena.sparql.core.TS_Core
Tests run: 42, Failures: 0, Errors: 0, Skipped: 0, Time elapsed: 0.02 sec
Running com.hp.hpl.jena.sparql.expr.TS_Expr
Tests run: 1023, Failures: 0, Errors: 0, Skipped: 0, Time elapsed: 0.407 sec
Running com.hp.hpl.jena.sparql.engine.TS_Engine
Tests run: 25, Failures: 0, Errors: 0, Skipped: 0, Time elapsed: 0.289 sec
Running com.hp.hpl.jena.sparql.engine.binding.TS_Binding
Tests run: 16, Failures: 0, Errors: 0, Skipped: 0, Time elapsed: 0.005 sec
Running com.hp.hpl.jena.sparql.solver.TS_Solver
Tests run: 23, Failures: 0, Errors: 0, Skipped: 0, Time elapsed: 0.024 sec
Running com.hp.hpl.jena.sparql.resultset.TS_ResultSet
Tests run: 104, Failures: 0, Errors: 0, Skipped: 0, Time elapsed: 0.15 sec
Running com.hp.hpl.jena.sparql.util.TS_Util
Tests run: 72, Failures: 0, Errors: 0, Skipped: 0, Time elapsed: 0.035 sec
Running com.hp.hpl.jena.sparql.path.TS_Path
Tests run: 109, Failures: 0, Errors: 0, Skipped: 7, Time elapsed: 0.06 sec
Running com.hp.hpl.jena.sparql.algebra.TS_Algebra
Tests run: 177, Failures: 0, Errors: 0, Skipped: 0, Time elapsed: 0.131 sec
Running com.hp.hpl.jena.sparql.TC_DAWG
Tests run: 467, Failures: 0, Errors: 0, Skipped: 0, Time elapsed: 2.071 sec
Running com.hp.hpl.jena.sparql.syntax.TS_Serialization
Tests run: 40, Failures: 0, Errors: 0, Skipped: 0, Time elapsed: 0.013 sec
Running com.hp.hpl.jena.sparql.syntax.TS_SSE
Tests run: 113, Failures: 0, Errors: 0, Skipped: 0, Time elapsed: 0.032 sec

Results :

Tests run: 4499, Failures: 0, Errors: 0, Skipped: 7

mojoSucceeded org.apache.maven.plugins:maven-surefire-plugin:2.12(default-test)
[JENKINS] Recording test results
projectSucceeded org.apache.jena:jena-arq:2.9.4-SNAPSHOT
projectStarted org.apache.jena:jena-tdb:0.9.4-SNAPSHOT
[INFO]                                                                         
[INFO] ------------------------------------------------------------------------
[INFO] Building jena-tdb 0.9.4-SNAPSHOT
[INFO] ------------------------------------------------------------------------
mojoStarted org.apache.maven.plugins:maven-clean-plugin:2.4.1(default-clean)
[INFO] 
[INFO] --- maven-clean-plugin:2.4.1:clean (default-clean) @ jena-tdb ---
mojoSucceeded org.apache.maven.plugins:maven-clean-plugin:2.4.1(default-clean)
mojoStarted org.apache.maven.plugins:maven-remote-resources-plugin:1.2.1(default)
[INFO] 
[INFO] --- maven-remote-resources-plugin:1.2.1:process (default) @ jena-tdb ---
mojoSucceeded org.apache.maven.plugins:maven-remote-resources-plugin:1.2.1(default)
[debug] execute contextualize
mojoStarted org.apache.maven.plugins:maven-resources-plugin:2.5(default-resources)[INFO] Using
'UTF-8' encoding to copy filtered resources.

[INFO] 
[INFO] --- maven-resources-plugin:2.5:resources (default-resources) @ jena-tdb ---
[INFO] Copying 0 resource
[INFO] Copying 1 resource
[INFO] Copying 3 resources
mojoSucceeded org.apache.maven.plugins:maven-resources-plugin:2.5(default-resources)
mojoStarted org.apache.maven.plugins:maven-compiler-plugin:2.4(default-compile)
[INFO] 
[INFO] --- maven-compiler-plugin:2.4:compile (default-compile) @ jena-tdb ---
[INFO] Compiling 280 source files to <https://builds.apache.org/job/Jena__Development_Test/ws/trunk/jena-tdb/target/classes>
mojoSucceeded org.apache.maven.plugins:maven-compiler-plugin:2.4(default-compile)
mojoStarted org.apache.maven.plugins:maven-resources-plugin:2.5(default-testResources)[debug]
execute contextualize
[INFO] Using 'UTF-8' encoding to copy filtered resources.

[INFO] 
[INFO] --- maven-resources-plugin:2.5:testResources (default-testResources) @ jena-tdb ---
[INFO] Copying 6 resources
[INFO] Copying 3 resources
mojoSucceeded org.apache.maven.plugins:maven-resources-plugin:2.5(default-testResources)
mojoStarted org.apache.maven.plugins:maven-compiler-plugin:2.4(default-testCompile)
[INFO] 
[INFO] --- maven-compiler-plugin:2.4:testCompile (default-testCompile) @ jena-tdb ---
[INFO] Compiling 130 source files to <https://builds.apache.org/job/Jena__Development_Test/ws/trunk/jena-tdb/target/test-classes>
mojoSucceeded org.apache.maven.plugins:maven-compiler-plugin:2.4(default-testCompile)
mojoStarted org.apache.maven.plugins:maven-surefire-plugin:2.12(default-test)[INFO] Surefire
report directory: <https://builds.apache.org/job/Jena__Development_Test/ws/trunk/jena-tdb/target/surefire-reports>

-------------------------------------------------------
 T E S T S
-------------------------------------------------------

[INFO] 
[INFO] --- maven-surefire-plugin:2.12:test (default-test) @ jena-tdb ---
Running tdb.TS_TDBLoader3
Tests run: 6, Failures: 0, Errors: 0, Skipped: 0, Time elapsed: 8.97 sec
Running com.hp.hpl.jena.tdb.transaction.TS_Transaction
Tests run: 104, Failures: 0, Errors: 0, Skipped: 0, Time elapsed: 52.928 sec
Running com.hp.hpl.jena.tdb.sys.TS_Sys
Tests run: 1, Failures: 0, Errors: 0, Skipped: 0, Time elapsed: 0 sec
Running com.hp.hpl.jena.tdb.base.objectfile.TS_ObjectFile
Tests run: 40, Failures: 0, Errors: 0, Skipped: 0, Time elapsed: 0.146 sec
Running com.hp.hpl.jena.tdb.base.record.TS_Record
Tests run: 54, Failures: 0, Errors: 0, Skipped: 0, Time elapsed: 0.019 sec
Running com.hp.hpl.jena.tdb.base.file.TS_File
Tests run: 39, Failures: 0, Errors: 0, Skipped: 0, Time elapsed: 0.2 sec
Running com.hp.hpl.jena.tdb.base.recordfile.TS_RecordFile
Tests run: 2, Failures: 0, Errors: 0, Skipped: 0, Time elapsed: 0.001 sec
Running com.hp.hpl.jena.tdb.base.block.TS_Block
Tests run: 18, Failures: 0, Errors: 0, Skipped: 0, Time elapsed: 0.276 sec
Running com.hp.hpl.jena.tdb.lib.TS_LibTDB
Tests run: 9, Failures: 0, Errors: 0, Skipped: 0, Time elapsed: 0.004 sec
Running com.hp.hpl.jena.tdb.graph.TS_Graph
Tests run: 67, Failures: 0, Errors: 0, Skipped: 4, Time elapsed: 1.748 sec
Running com.hp.hpl.jena.tdb.index.TS_Index
Tests run: 97, Failures: 0, Errors: 0, Skipped: 0, Time elapsed: 0.427 sec
Running com.hp.hpl.jena.tdb.solver.TS_SolverTDB
Tests run: 6, Failures: 0, Errors: 0, Skipped: 0, Time elapsed: 0.043 sec
Running com.hp.hpl.jena.tdb.TS_Factory
Tests run: 5, Failures: 0, Errors: 0, Skipped: 0, Time elapsed: 0.68 sec
Running com.hp.hpl.jena.tdb.store.TS_Store
Wrong mode
Tests run: 191, Failures: 0, Errors: 0, Skipped: 0, Time elapsed: 23.798 sec
Running com.hp.hpl.jena.tdb.TS_Jena
Tests run: 73, Failures: 0, Errors: 0, Skipped: 0, Time elapsed: 0.125 sec
Running com.hp.hpl.jena.tdb.nodetable.TS_NodeTable
Tests run: 40, Failures: 0, Errors: 0, Skipped: 0, Time elapsed: 0.014 sec
Running com.hp.hpl.jena.tdb.assembler.TS_TDBAssembler
Tests run: 7, Failures: 0, Errors: 0, Skipped: 0, Time elapsed: 2.322 sec

Results :

Tests run: 759, Failures: 0, Errors: 0, Skipped: 4

mojoSucceeded org.apache.maven.plugins:maven-surefire-plugin:2.12(default-test)
[JENKINS] Recording test results
projectSucceeded org.apache.jena:jena-tdb:0.9.4-SNAPSHOT
projectStarted org.apache.jena:jena-fuseki:0.2.5-SNAPSHOT
[INFO]                                                                         
[INFO] ------------------------------------------------------------------------
[INFO] Building jena-fuseki 0.2.5-SNAPSHOT
[INFO] ------------------------------------------------------------------------
mojoStarted org.apache.maven.plugins:maven-clean-plugin:2.4.1(default-clean)
[INFO] 
[INFO] --- maven-clean-plugin:2.4.1:clean (default-clean) @ jena-fuseki ---
mojoSucceeded org.apache.maven.plugins:maven-clean-plugin:2.4.1(default-clean)
mojoStarted org.apache.maven.plugins:maven-remote-resources-plugin:1.2.1(default)
[INFO] 
[INFO] --- maven-remote-resources-plugin:1.2.1:process (default) @ jena-fuseki ---
mojoSucceeded org.apache.maven.plugins:maven-remote-resources-plugin:1.2.1(default)
mojoStarted org.apache.maven.plugins:maven-resources-plugin:2.5(default-resources)[debug]
execute contextualize
[INFO] Using 'UTF-8' encoding to copy filtered resources.

[INFO] 
[INFO] --- maven-resources-plugin:2.5:resources (default-resources) @ jena-fuseki ---
[INFO] Copying 1 resource
[INFO] Copying 1 resource
[INFO] Copying 3 resources
mojoSucceeded org.apache.maven.plugins:maven-resources-plugin:2.5(default-resources)
mojoStarted org.apache.maven.plugins:maven-compiler-plugin:2.3.2(default-compile)
[INFO] 
[INFO] --- maven-compiler-plugin:2.3.2:compile (default-compile) @ jena-fuseki ---
[INFO] Compiling 67 source files to <https://builds.apache.org/job/Jena__Development_Test/ws/trunk/jena-fuseki/target/classes>
[INFO] -------------------------------------------------------------
[ERROR] COMPILATION ERROR : 
[INFO] -------------------------------------------------------------
[ERROR] <https://builds.apache.org/job/Jena__Development_Test/ws/trunk/jena-fuseki/src/main/java/org/apache/jena/fuseki/servlets/SPARQL_?berServlet.java>:[44,7]
class SPARQL_?berServlet is public, should be declared in a file named SPARQL_?berServlet.java
[INFO] 1 error
[INFO] -------------------------------------------------------------
mojoFailed org.apache.maven.plugins:maven-compiler-plugin:2.3.2(default-compile)
projectFailed org.apache.jena:jena-fuseki:0.2.5-SNAPSHOT
sessionEnded
[INFO] ------------------------------------------------------------------------
[INFO] Reactor Summary:
[INFO] 
[INFO] jena-parent ....................................... SUCCESS [20.265s]
[INFO] jena-iri .......................................... SUCCESS [19.421s]
[INFO] jena-core ......................................... SUCCESS [58.889s]
[INFO] jena-arq .......................................... SUCCESS [36.434s]
[INFO] jena-tdb .......................................... SUCCESS [1:38.618s]
[INFO] jena-fuseki ....................................... FAILURE [3.565s]
[INFO] apache-jena ....................................... SKIPPED
[INFO] Apache Jena ....................................... SKIPPED
[INFO] ------------------------------------------------------------------------
[INFO] BUILD FAILURE
[INFO] ------------------------------------------------------------------------
[INFO] Total time: 3:59.724s
[INFO] Finished at: Wed Aug 29 11:46:53 UTC 2012
[INFO] Final Memory: 33M/167M
[INFO] ------------------------------------------------------------------------
Projects to build: [MavenProject: org.apache.jena:jena-parent:4-SNAPSHOT @ <https://builds.apache.org/job/Jena__Development_Test/ws/trunk/jena-parent/pom.xml,>
MavenProject: org.apache.jena:jena-iri:0.9.4-SNAPSHOT @ <https://builds.apache.org/job/Jena__Development_Test/ws/trunk/jena-iri/pom.xml,>
MavenProject: org.apache.jena:jena-core:2.7.4-SNAPSHOT @ <https://builds.apache.org/job/Jena__Development_Test/ws/trunk/jena-core/pom.xml,>
MavenProject: org.apache.jena:jena-arq:2.9.4-SNAPSHOT @ <https://builds.apache.org/job/Jena__Development_Test/ws/trunk/jena-arq/pom.xml,>
MavenProject: org.apache.jena:jena-tdb:0.9.4-SNAPSHOT @ <https://builds.apache.org/job/Jena__Development_Test/ws/trunk/jena-tdb/pom.xml,>
MavenProject: org.apache.jena:jena-fuseki:0.2.5-SNAPSHOT @ <https://builds.apache.org/job/Jena__Development_Test/ws/trunk/jena-fuseki/pom.xml,>
MavenProject: org.apache.jena:apache-jena:2.7.4-SNAPSHOT @ <https://builds.apache.org/job/Jena__Development_Test/ws/trunk/apache-jena/pom.xml,>
MavenProject: org.apache.jena:jena:2.7.4-SNAPSHOT @ <https://builds.apache.org/job/Jena__Development_Test/ws/trunk/pom.xml]>
[JENKINS] Archiving disabled - not archiving <https://builds.apache.org/job/Jena__Development_Test/ws/trunk/jena-iri/pom.xml>
[JENKINS] Archiving disabled - not archiving <https://builds.apache.org/job/Jena__Development_Test/ws/trunk/jena-arq/pom.xml>
[JENKINS] Archiving disabled - not archiving <https://builds.apache.org/job/Jena__Development_Test/ws/trunk/jena-parent/pom.xml>
[JENKINS] Archiving disabled - not archiving <https://builds.apache.org/job/Jena__Development_Test/ws/trunk/jena-tdb/pom.xml>
[JENKINS] Archiving disabled - not archiving <https://builds.apache.org/job/Jena__Development_Test/ws/trunk/pom.xml>
[JENKINS] Archiving disabled - not archiving <https://builds.apache.org/job/Jena__Development_Test/ws/trunk/jena-fuseki/pom.xml>
[JENKINS] Archiving disabled - not archiving <https://builds.apache.org/job/Jena__Development_Test/ws/trunk/apache-jena/pom.xml>
[JENKINS] Archiving disabled - not archiving <https://builds.apache.org/job/Jena__Development_Test/ws/trunk/jena-core/pom.xml>
Waiting for Jenkins to finish collecting data
mavenExecutionResult exceptions not empty
message : Failed to execute goal org.apache.maven.plugins:maven-compiler-plugin:2.3.2:compile
(default-compile) on project jena-fuseki: Compilation failure
<https://builds.apache.org/job/Jena__Development_Test/ws/trunk/jena-fuseki/src/main/java/org/apache/jena/fuseki/servlets/SPARQL_?berServlet.java>:[44,7]
class SPARQL_?berServlet is public, should be declared in a file named SPARQL_?berServlet.java

cause : Compilation failure
<https://builds.apache.org/job/Jena__Development_Test/ws/trunk/jena-fuseki/src/main/java/org/apache/jena/fuseki/servlets/SPARQL_?berServlet.java>:[44,7]
class SPARQL_?berServlet is public, should be declared in a file named SPARQL_?berServlet.java

Stack trace : 
org.apache.maven.lifecycle.LifecycleExecutionException: Failed to execute goal org.apache.maven.plugins:maven-compiler-plugin:2.3.2:compile
(default-compile) on project jena-fuseki: Compilation failure
<https://builds.apache.org/job/Jena__Development_Test/ws/trunk/jena-fuseki/src/main/java/org/apache/jena/fuseki/servlets/SPARQL_?berServlet.java>:[44,7]
class SPARQL_?berServlet is public, should be declared in a file named SPARQL_?berServlet.java

	at org.apache.maven.lifecycle.internal.MojoExecutor.execute(MojoExecutor.java:213)
	at org.apache.maven.lifecycle.internal.MojoExecutor.execute(MojoExecutor.java:153)
	at org.apache.maven.lifecycle.internal.MojoExecutor.execute(MojoExecutor.java:145)
	at org.apache.maven.lifecycle.internal.LifecycleModuleBuilder.buildProject(LifecycleModuleBuilder.java:84)
	at org.apache.maven.lifecycle.internal.LifecycleModuleBuilder.buildProject(LifecycleModuleBuilder.java:59)
	at org.apache.maven.lifecycle.internal.LifecycleStarter.singleThreadedBuild(LifecycleStarter.java:183)
	at org.apache.maven.lifecycle.internal.LifecycleStarter.execute(LifecycleStarter.java:161)
	at org.apache.maven.DefaultMaven.doExecute(DefaultMaven.java:319)
	at org.apache.maven.DefaultMaven.execute(DefaultMaven.java:156)
	at org.jvnet.hudson.maven3.launcher.Maven3Launcher.main(Maven3Launcher.java:79)
	at sun.reflect.NativeMethodAccessorImpl.invoke0(Native Method)
	at sun.reflect.NativeMethodAccessorImpl.invoke(NativeMethodAccessorImpl.java:39)
	at sun.reflect.DelegatingMethodAccessorImpl.invoke(DelegatingMethodAccessorImpl.java:25)
	at java.lang.reflect.Method.invoke(Method.java:597)
	at org.codehaus.plexus.classworlds.launcher.Launcher.launchStandard(Launcher.java:329)
	at org.codehaus.plexus.classworlds.launcher.Launcher.launch(Launcher.java:239)
	at org.jvnet.hudson.maven3.agent.Maven3Main.launch(Maven3Main.java:158)
	at hudson.maven.Maven3Builder.call(Maven3Builder.java:98)
	at hudson.maven.Maven3Builder.call(Maven3Builder.java:64)
	at hudson.remoting.UserRequest.perform(UserRequest.java:118)
	at hudson.remoting.UserRequest.perform(UserRequest.java:48)
	at hudson.remoting.Request$2.run(Request.java:326)
	at hudson.remoting.InterceptingExecutorService$1.call(InterceptingExecutorService.java:72)
	at java.util.concurrent.FutureTask$Sync.innerRun(FutureTask.java:303)
	at java.util.concurrent.FutureTask.run(FutureTask.java:138)
	at java.util.concurrent.ThreadPoolExecutor$Worker.runTask(ThreadPoolExecutor.java:886)
	at java.util.concurrent.ThreadPoolExecutor$Worker.run(ThreadPoolExecutor.java:908)
	at java.lang.Thread.run(Thread.java:662)
Caused by: org.apache.maven.plugin.CompilationFailureException: Compilation failure
<https://builds.apache.org/job/Jena__Development_Test/ws/trunk/jena-fuseki/src/main/java/org/apache/jena/fuseki/servlets/SPARQL_?berServlet.java>:[44,7]
class SPARQL_?berServlet is public, should be declared in a file named SPARQL_?berServlet.java

	at org.apache.maven.plugin.AbstractCompilerMojo.execute(AbstractCompilerMojo.java:656)
	at org.apache.maven.plugin.CompilerMojo.execute(CompilerMojo.java:128)
	at org.apache.maven.plugin.DefaultBuildPluginManager.executeMojo(DefaultBuildPluginManager.java:101)
	at org.apache.maven.lifecycle.internal.MojoExecutor.execute(MojoExecutor.java:209)
	... 27 more
Sending e-mails to: commits@jena.apache.org
channel stopped

Mime
View raw message