jena-commits mailing list archives

Site index · List index
Message view « Date » · « Thread »
Top « Date » · « Thread »
From Apache Jenkins Server <jenk...@builds.apache.org>
Subject Build failed in Jenkins: Jena_SDB #346
Date Thu, 16 Aug 2012 21:51:37 GMT
See <https://builds.apache.org/job/Jena_SDB/346/changes>

Changes:

[damian] Attempt to fix Oracle syntax issue.

[andy] Fix versions inc this is 1.3.5-SNAPSHOT

------------------------------------------
Started by an SCM change
Building remotely on ubuntu4 in workspace <https://builds.apache.org/job/Jena_SDB/ws/>
Updating http://svn.apache.org/repos/asf/jena/trunk/jena-sdb
U         src/com/hp/hpl/jena/sdb/layout2/hash/TupleLoaderHashOracle.java
U         src/com/hp/hpl/jena/sdb/layout2/index/TupleLoaderIndexOracle.java
U         pom.xml
U         .classpath
At revision 1374071
Parsing POMs
Downloaded artifact http://repo.maven.apache.org/maven2//org/apache/jena/jena-parent/3/jena-parent-3.pom
Modules changed, recalculating dependency graph
[jena-sdb] $ /home/hudson/tools/java/latest1.6/bin/java -cp /home/jenkins/jenkins-slave/maven3-agent.jar:/home/hudson/tools/maven/latest3/boot/plexus-classworlds-2.4.jar
org.jvnet.hudson.maven3.agent.Maven3Main /home/hudson/tools/maven/latest3 /home/jenkins/jenkins-slave/slave.jar
/home/jenkins/jenkins-slave/maven3-interceptor.jar 54106
<===[JENKINS REMOTING CAPACITY]===>channel started
   log4j:WARN No appenders could be found for logger (org.apache.commons.beanutils.converters.BooleanConverter).
log4j:WARN Please initialize the log4j system properly.
Executing Maven:  -B -f <https://builds.apache.org/job/Jena_SDB/ws/jena-sdb/pom.xml>
-Dmaven.repo.local=/home/jenkins/jenkins-slave/maven-repositories/0 clean install
[INFO] Scanning for projects...
Projects to build: [MavenProject: org.apache.jena:jena-sdb:1.3.5-SNAPSHOT @ <https://builds.apache.org/job/Jena_SDB/ws/jena-sdb/pom.xml]>
projectStarted org.apache.jena:jena-sdb:1.3.5-SNAPSHOT
[INFO]                                                                         
[INFO] ------------------------------------------------------------------------
[INFO] Building jena-sdb 1.3.5-SNAPSHOT
[INFO] ------------------------------------------------------------------------
Downloading: http://repo1.maven.org/maven2/org/apache/jena/jena-core/2.7.3/jena-core-2.7.3.pom
Downloaded: http://repo1.maven.org/maven2/org/apache/jena/jena-core/2.7.3/jena-core-2.7.3.pom
(9 KB at 25.0 KB/sec)
Downloading: http://repo1.maven.org/maven2/org/apache/jena/jena-iri/0.9.3/jena-iri-0.9.3.pom
Downloaded: http://repo1.maven.org/maven2/org/apache/jena/jena-iri/0.9.3/jena-iri-0.9.3.pom
(6 KB at 12.7 KB/sec)
Downloading: http://repo1.maven.org/maven2/org/apache/jena/jena-arq/2.9.3/jena-arq-2.9.3.pom
Downloaded: http://repo1.maven.org/maven2/org/apache/jena/jena-arq/2.9.3/jena-arq-2.9.3.pom
(8 KB at 21.4 KB/sec)
Downloading: http://repo1.maven.org/maven2/org/apache/jena/jena-core/2.7.3/jena-core-2.7.3.jar
Downloading: http://repo1.maven.org/maven2/org/apache/jena/jena-iri/0.9.3/jena-iri-0.9.3.jar
Downloading: http://repo1.maven.org/maven2/org/apache/jena/jena-core/2.7.3/jena-core-2.7.3-tests.jar
Downloading: http://repo1.maven.org/maven2/org/apache/jena/jena-arq/2.9.3/jena-arq-2.9.3.jar
Downloading: http://repo1.maven.org/maven2/org/apache/jena/jena-arq/2.9.3/jena-arq-2.9.3-tests.jar
Downloaded: http://repo1.maven.org/maven2/org/apache/jena/jena-core/2.7.3/jena-core-2.7.3-tests.jar
(1459 KB at 9407.7 KB/sec)
Downloaded: http://repo1.maven.org/maven2/org/apache/jena/jena-arq/2.9.3/jena-arq-2.9.3-tests.jar
(414 KB at 2685.4 KB/sec)
Downloaded: http://repo1.maven.org/maven2/org/apache/jena/jena-iri/0.9.3/jena-iri-0.9.3.jar
(134 KB at 302.2 KB/sec)
Downloaded: http://repo1.maven.org/maven2/org/apache/jena/jena-core/2.7.3/jena-core-2.7.3.jar
(1682 KB at 3329.5 KB/sec)
Downloaded: http://repo1.maven.org/maven2/org/apache/jena/jena-arq/2.9.3/jena-arq-2.9.3.jar
(2292 KB at 3525.9 KB/sec)
mojoStarted org.apache.maven.plugins:maven-clean-plugin:2.4.1(default-clean)
[INFO] [INFO] Deleting <https://builds.apache.org/job/Jena_SDB/ws/jena-sdb/target>

[INFO] --- maven-clean-plugin:2.4.1:clean (default-clean) @ jena-sdb ---
mojoSucceeded org.apache.maven.plugins:maven-clean-plugin:2.4.1(default-clean)
mojoStarted org.apache.maven.plugins:maven-remote-resources-plugin:1.2.1(default)
[INFO] 
[INFO] --- maven-remote-resources-plugin:1.2.1:process (default) @ jena-sdb ---
mojoSucceeded org.apache.maven.plugins:maven-remote-resources-plugin:1.2.1(default)
mojoStarted org.apache.maven.plugins:maven-resources-plugin:2.5(default-resources)[debug]
execute contextualize
[INFO] Using 'UTF-8' encoding to copy filtered resources.

[INFO] 
[INFO] --- maven-resources-plugin:2.5:resources (default-resources) @ jena-sdb ---
[INFO] Copying 1 resource to com/hp/hpl/jena/sdb/
[INFO] Copying 3 resources
mojoSucceeded org.apache.maven.plugins:maven-resources-plugin:2.5(default-resources)
mojoStarted org.apache.maven.plugins:maven-compiler-plugin:2.3.2(default-compile)
[INFO] 
[INFO] --- maven-compiler-plugin:2.3.2:compile (default-compile) @ jena-sdb ---
[INFO] Compiling 350 source files to <https://builds.apache.org/job/Jena_SDB/ws/jena-sdb/target/classes>
[INFO] -------------------------------------------------------------
[ERROR] COMPILATION ERROR : 
[INFO] -------------------------------------------------------------
[ERROR] <https://builds.apache.org/job/Jena_SDB/ws/jena-sdb/src/com/hp/hpl/jena/sdb/layout2/index/TupleLoaderIndexOracle.java>:[96,24]
';' expected
[INFO] 1 error
[INFO] -------------------------------------------------------------
mojoFailed org.apache.maven.plugins:maven-compiler-plugin:2.3.2(default-compile)
projectFailed org.apache.jena:jena-sdb:1.3.5-SNAPSHOT
sessionEnded
[INFO] ------------------------------------------------------------------------
[INFO] BUILD FAILURE
[INFO] ------------------------------------------------------------------------
[INFO] Total time: 38.319s
[INFO] Finished at: Thu Aug 16 21:51:32 UTC 2012
[INFO] Final Memory: 11M/75M
[INFO] ------------------------------------------------------------------------
Projects to build: [MavenProject: org.apache.jena:jena-sdb:1.3.5-SNAPSHOT @ <https://builds.apache.org/job/Jena_SDB/ws/jena-sdb/pom.xml]>
[JENKINS] Archiving disabled - not archiving <https://builds.apache.org/job/Jena_SDB/ws/jena-sdb/pom.xml>
Waiting for Jenkins to finish collecting data
mavenExecutionResult exceptions not empty
message : Failed to execute goal org.apache.maven.plugins:maven-compiler-plugin:2.3.2:compile
(default-compile) on project jena-sdb: Compilation failure
<https://builds.apache.org/job/Jena_SDB/ws/jena-sdb/src/com/hp/hpl/jena/sdb/layout2/index/TupleLoaderIndexOracle.java>:[96,24]
';' expected

cause : Compilation failure
<https://builds.apache.org/job/Jena_SDB/ws/jena-sdb/src/com/hp/hpl/jena/sdb/layout2/index/TupleLoaderIndexOracle.java>:[96,24]
';' expected

Stack trace : 
org.apache.maven.lifecycle.LifecycleExecutionException: Failed to execute goal org.apache.maven.plugins:maven-compiler-plugin:2.3.2:compile
(default-compile) on project jena-sdb: Compilation failure
<https://builds.apache.org/job/Jena_SDB/ws/jena-sdb/src/com/hp/hpl/jena/sdb/layout2/index/TupleLoaderIndexOracle.java>:[96,24]
';' expected

	at org.apache.maven.lifecycle.internal.MojoExecutor.execute(MojoExecutor.java:213)
	at org.apache.maven.lifecycle.internal.MojoExecutor.execute(MojoExecutor.java:153)
	at org.apache.maven.lifecycle.internal.MojoExecutor.execute(MojoExecutor.java:145)
	at org.apache.maven.lifecycle.internal.LifecycleModuleBuilder.buildProject(LifecycleModuleBuilder.java:84)
	at org.apache.maven.lifecycle.internal.LifecycleModuleBuilder.buildProject(LifecycleModuleBuilder.java:59)
	at org.apache.maven.lifecycle.internal.LifecycleStarter.singleThreadedBuild(LifecycleStarter.java:183)
	at org.apache.maven.lifecycle.internal.LifecycleStarter.execute(LifecycleStarter.java:161)
	at org.apache.maven.DefaultMaven.doExecute(DefaultMaven.java:319)
	at org.apache.maven.DefaultMaven.execute(DefaultMaven.java:156)
	at org.jvnet.hudson.maven3.launcher.Maven3Launcher.main(Maven3Launcher.java:79)
	at sun.reflect.NativeMethodAccessorImpl.invoke0(Native Method)
	at sun.reflect.NativeMethodAccessorImpl.invoke(NativeMethodAccessorImpl.java:39)
	at sun.reflect.DelegatingMethodAccessorImpl.invoke(DelegatingMethodAccessorImpl.java:25)
	at java.lang.reflect.Method.invoke(Method.java:597)
	at org.codehaus.plexus.classworlds.launcher.Launcher.launchStandard(Launcher.java:329)
	at org.codehaus.plexus.classworlds.launcher.Launcher.launch(Launcher.java:239)
	at org.jvnet.hudson.maven3.agent.Maven3Main.launch(Maven3Main.java:158)
	at hudson.maven.Maven3Builder.call(Maven3Builder.java:98)
	at hudson.maven.Maven3Builder.call(Maven3Builder.java:64)
	at hudson.remoting.UserRequest.perform(UserRequest.java:118)
	at hudson.remoting.UserRequest.perform(UserRequest.java:48)
	at hudson.remoting.Request$2.run(Request.java:326)
	at hudson.remoting.InterceptingExecutorService$1.call(InterceptingExecutorService.java:72)
	at java.util.concurrent.FutureTask$Sync.innerRun(FutureTask.java:303)
	at java.util.concurrent.FutureTask.run(FutureTask.java:138)
	at java.util.concurrent.ThreadPoolExecutor$Worker.runTask(ThreadPoolExecutor.java:886)
	at java.util.concurrent.ThreadPoolExecutor$Worker.run(ThreadPoolExecutor.java:908)
	at java.lang.Thread.run(Thread.java:662)
Caused by: org.apache.maven.plugin.CompilationFailureException: Compilation failure
<https://builds.apache.org/job/Jena_SDB/ws/jena-sdb/src/com/hp/hpl/jena/sdb/layout2/index/TupleLoaderIndexOracle.java>:[96,24]
';' expected

	at org.apache.maven.plugin.AbstractCompilerMojo.execute(AbstractCompilerMojo.java:656)
	at org.apache.maven.plugin.CompilerMojo.execute(CompilerMojo.java:128)
	at org.apache.maven.plugin.DefaultBuildPluginManager.executeMojo(DefaultBuildPluginManager.java:101)
	at org.apache.maven.lifecycle.internal.MojoExecutor.execute(MojoExecutor.java:209)
	... 27 more
Sending e-mails to: commits@jena.apache.org
channel stopped

Mime
View raw message