jena-commits mailing list archives

Site index · List index
Message view « Date » · « Thread »
Top « Date » · « Thread »
From Apache Jenkins Server <jenk...@builds.apache.org>
Subject Build failed in Jenkins: Jena_Fuseki #598
Date Wed, 13 Jun 2012 13:32:12 GMT
See <https://builds.apache.org/job/Jena_Fuseki/598/changes>

Changes:

[andy] Prepare for release (cycle 2)

------------------------------------------
Started by an SCM change
Building remotely on ubuntu4 in workspace <https://builds.apache.org/job/Jena_Fuseki/ws/>
Cleaning up <https://builds.apache.org/job/Jena_Fuseki/ws/jena-fuseki>
Deleting <https://builds.apache.org/job/Jena_Fuseki/ws/jena-fuseki/target>
Updating http://svn.apache.org/repos/asf/jena/trunk/jena-fuseki
U         pom.xml
D         dist/dist-fuseki.sh
A         dist/ABOUT
At revision 1349835
Parsing POMs
Modules changed, recalculating dependency graph
[jena-fuseki] $ /home/hudson/tools/java/latest1.6/bin/java -cp /home/jenkins/jenkins-slave/maven3-agent.jar:/home/hudson/tools/maven/apache-maven-3.0.3/boot/plexus-classworlds-2.4.jar
org.jvnet.hudson.maven3.agent.Maven3Main /home/hudson/tools/maven/apache-maven-3.0.3 /home/jenkins/jenkins-slave/slave.jar
/home/jenkins/jenkins-slave/maven3-interceptor.jar 47036
<===[JENKINS REMOTING CAPACITY]===>channel started
   log4j:WARN No appenders could be found for logger (org.apache.commons.beanutils.converters.BooleanConverter).
log4j:WARN Please initialize the log4j system properly.
Executing Maven:  -B -f <https://builds.apache.org/job/Jena_Fuseki/ws/jena-fuseki/pom.xml>
-Dmaven.repo.local=/home/jenkins/jenkins-slave/maven-repositories/1 clean install
[INFO] Scanning for projects...
Projects to build: [MavenProject: org.apache.jena:jena-fuseki:0.2.2-SNAPSHOT @ <https://builds.apache.org/job/Jena_Fuseki/ws/jena-fuseki/pom.xml]>
projectStarted org.apache.jena:jena-fuseki:0.2.2-SNAPSHOT
[INFO]                                                                         
[INFO] ------------------------------------------------------------------------
[INFO] Building jena-fuseki 0.2.2-SNAPSHOT
[INFO] ------------------------------------------------------------------------
Downloading: http://repo1.maven.org/maven2/org/apache/jena/jena-arq/2.9.1/jena-arq-2.9.1.pom
[WARNING] The POM for org.apache.jena:jena-arq:jar:2.9.1 is missing, no dependency information
available
Downloading: http://repo1.maven.org/maven2/org/apache/jena/jena-core/2.7.1/jena-core-2.7.1.pom
[WARNING] The POM for org.apache.jena:jena-core:jar:2.7.1 is missing, no dependency information
available
Downloading: http://repo1.maven.org/maven2/org/apache/jena/jena-tdb/0.9.1/jena-tdb-0.9.1.pom
[WARNING] The POM for org.apache.jena:jena-tdb:jar:0.9.1 is missing, no dependency information
available
Downloading: http://repo1.maven.org/maven2/org/apache/jena/jena-arq/2.9.1/jena-arq-2.9.1.jar
Downloading: http://repo1.maven.org/maven2/org/apache/jena/jena-core/2.7.1/jena-core-2.7.1.jar
Downloading: http://repo1.maven.org/maven2/org/apache/jena/jena-tdb/0.9.1/jena-tdb-0.9.1.jar
projectFailed org.apache.jena:jena-fuseki:0.2.2-SNAPSHOT
sessionEnded
[INFO] ------------------------------------------------------------------------
[INFO] BUILD FAILURE
[INFO] ------------------------------------------------------------------------
[INFO] Total time: 3.655s
[INFO] Finished at: Wed Jun 13 13:31:49 UTC 2012
[INFO] Final Memory: 5M/78M
[INFO] ------------------------------------------------------------------------
Projects to build: [MavenProject: org.apache.jena:jena-fuseki:0.2.2-SNAPSHOT @ <https://builds.apache.org/job/Jena_Fuseki/ws/jena-fuseki/pom.xml]>
[JENKINS] Archiving disabled - not archiving <https://builds.apache.org/job/Jena_Fuseki/ws/jena-fuseki/pom.xml>
Waiting for Jenkins to finish collecting data
mavenExecutionResult exceptions not empty
message : Failed to execute goal on project jena-fuseki: Could not resolve dependencies for
project org.apache.jena:jena-fuseki:jar:0.2.2-SNAPSHOT: The following artifacts could not
be resolved: org.apache.jena:jena-arq:jar:2.9.1, org.apache.jena:jena-core:jar:2.7.1, org.apache.jena:jena-tdb:jar:0.9.1:
Could not find artifact org.apache.jena:jena-arq:jar:2.9.1 in central (http://repo1.maven.org/maven2)
cause : Could not resolve dependencies for project org.apache.jena:jena-fuseki:jar:0.2.2-SNAPSHOT:
The following artifacts could not be resolved: org.apache.jena:jena-arq:jar:2.9.1, org.apache.jena:jena-core:jar:2.7.1,
org.apache.jena:jena-tdb:jar:0.9.1: Could not find artifact org.apache.jena:jena-arq:jar:2.9.1
in central (http://repo1.maven.org/maven2)
Stack trace : 
org.apache.maven.lifecycle.LifecycleExecutionException: Failed to execute goal on project
jena-fuseki: Could not resolve dependencies for project org.apache.jena:jena-fuseki:jar:0.2.2-SNAPSHOT:
The following artifacts could not be resolved: org.apache.jena:jena-arq:jar:2.9.1, org.apache.jena:jena-core:jar:2.7.1,
org.apache.jena:jena-tdb:jar:0.9.1: Could not find artifact org.apache.jena:jena-arq:jar:2.9.1
in central (http://repo1.maven.org/maven2)
	at org.apache.maven.lifecycle.internal.LifecycleDependencyResolver.getDependencies(LifecycleDependencyResolver.java:196)
	at org.apache.maven.lifecycle.internal.LifecycleDependencyResolver.resolveProjectDependencies(LifecycleDependencyResolver.java:108)
	at org.apache.maven.lifecycle.internal.MojoExecutor.ensureDependenciesAreResolved(MojoExecutor.java:258)
	at org.apache.maven.lifecycle.internal.MojoExecutor.execute(MojoExecutor.java:201)
	at org.apache.maven.lifecycle.internal.MojoExecutor.execute(MojoExecutor.java:153)
	at org.apache.maven.lifecycle.internal.MojoExecutor.execute(MojoExecutor.java:145)
	at org.apache.maven.lifecycle.internal.LifecycleModuleBuilder.buildProject(LifecycleModuleBuilder.java:84)
	at org.apache.maven.lifecycle.internal.LifecycleModuleBuilder.buildProject(LifecycleModuleBuilder.java:59)
	at org.apache.maven.lifecycle.internal.LifecycleStarter.singleThreadedBuild(LifecycleStarter.java:183)
	at org.apache.maven.lifecycle.internal.LifecycleStarter.execute(LifecycleStarter.java:161)
	at org.apache.maven.DefaultMaven.doExecute(DefaultMaven.java:319)
	at org.apache.maven.DefaultMaven.execute(DefaultMaven.java:156)
	at org.jvnet.hudson.maven3.launcher.Maven3Launcher.main(Maven3Launcher.java:79)
	at sun.reflect.NativeMethodAccessorImpl.invoke0(Native Method)
	at sun.reflect.NativeMethodAccessorImpl.invoke(NativeMethodAccessorImpl.java:39)
	at sun.reflect.DelegatingMethodAccessorImpl.invoke(DelegatingMethodAccessorImpl.java:25)
	at java.lang.reflect.Method.invoke(Method.java:597)
	at org.codehaus.plexus.classworlds.launcher.Launcher.launchStandard(Launcher.java:329)
	at org.codehaus.plexus.classworlds.launcher.Launcher.launch(Launcher.java:239)
	at org.jvnet.hudson.maven3.agent.Maven3Main.launch(Maven3Main.java:158)
	at hudson.maven.Maven3Builder.call(Maven3Builder.java:98)
	at hudson.maven.Maven3Builder.call(Maven3Builder.java:64)
	at hudson.remoting.UserRequest.perform(UserRequest.java:118)
	at hudson.remoting.UserRequest.perform(UserRequest.java:48)
	at hudson.remoting.Request$2.run(Request.java:287)
	at hudson.remoting.InterceptingExecutorService$1.call(InterceptingExecutorService.java:72)
	at java.util.concurrent.FutureTask$Sync.innerRun(FutureTask.java:303)
	at java.util.concurrent.FutureTask.run(FutureTask.java:138)
	at java.util.concurrent.ThreadPoolExecutor$Worker.runTask(ThreadPoolExecutor.java:886)
	at java.util.concurrent.ThreadPoolExecutor$Worker.run(ThreadPoolExecutor.java:908)
	at java.lang.Thread.run(Thread.java:662)
Caused by: org.apache.maven.project.DependencyResolutionException: Could not resolve dependencies
for project org.apache.jena:jena-fuseki:jar:0.2.2-SNAPSHOT: The following artifacts could
not be resolved: org.apache.jena:jena-arq:jar:2.9.1, org.apache.jena:jena-core:jar:2.7.1,
org.apache.jena:jena-tdb:jar:0.9.1: Could not find artifact org.apache.jena:jena-arq:jar:2.9.1
in central (http://repo1.maven.org/maven2)
	at org.apache.maven.project.DefaultProjectDependenciesResolver.resolve(DefaultProjectDependenciesResolver.java:170)
	at org.apache.maven.lifecycle.internal.LifecycleDependencyResolver.getDependencies(LifecycleDependencyResolver.java:171)
	... 30 more
Caused by: org.sonatype.aether.resolution.DependencyResolutionException: The following artifacts
could not be resolved: org.apache.jena:jena-arq:jar:2.9.1, org.apache.jena:jena-core:jar:2.7.1,
org.apache.jena:jena-tdb:jar:0.9.1: Could not find artifact org.apache.jena:jena-arq:jar:2.9.1
in central (http://repo1.maven.org/maven2)
	at org.sonatype.aether.impl.internal.DefaultRepositorySystem.resolveDependencies(DefaultRepositorySystem.java:412)
	at org.apache.maven.project.DefaultProjectDependenciesResolver.resolve(DefaultProjectDependenciesResolver.java:164)
	... 31 more
Caused by: org.sonatype.aether.resolution.ArtifactResolutionException: The following artifacts
could not be resolved: org.apache.jena:jena-arq:jar:2.9.1, org.apache.jena:jena-core:jar:2.7.1,
org.apache.jena:jena-tdb:jar:0.9.1: Could not find artifact org.apache.jena:jena-arq:jar:2.9.1
in central (http://repo1.maven.org/maven2)
	at org.sonatype.aether.impl.internal.DefaultArtifactResolver.resolve(DefaultArtifactResolver.java:541)
	at org.sonatype.aether.impl.internal.DefaultArtifactResolver.resolveArtifacts(DefaultArtifactResolver.java:220)
	at org.sonatype.aether.impl.internal.DefaultRepositorySystem.resolveDependencies(DefaultRepositorySystem.java:395)
	... 32 more
Caused by: org.sonatype.aether.transfer.ArtifactNotFoundException: Could not find artifact
org.apache.jena:jena-arq:jar:2.9.1 in central (http://repo1.maven.org/maven2)
	at org.sonatype.aether.connector.wagon.WagonRepositoryConnector$4.wrap(WagonRepositoryConnector.java:945)
	at org.sonatype.aether.connector.wagon.WagonRepositoryConnector$4.wrap(WagonRepositoryConnector.java:940)
	at org.sonatype.aether.connector.wagon.WagonRepositoryConnector$GetTask.flush(WagonRepositoryConnector.java:695)
	at org.sonatype.aether.connector.wagon.WagonRepositoryConnector$GetTask.flush(WagonRepositoryConnector.java:689)
	at org.sonatype.aether.connector.wagon.WagonRepositoryConnector.get(WagonRepositoryConnector.java:445)
	at org.sonatype.aether.impl.internal.DefaultArtifactResolver.resolve(DefaultArtifactResolver.java:460)
	... 34 more
Sending e-mails to: commits@jena.apache.org
channel stopped

Mime
View raw message