jena-commits mailing list archives

Site index · List index
Message view « Date » · « Thread »
Top « Date » · « Thread »
From Apache Jenkins Server <jenk...@builds.apache.org>
Subject Build failed in Jenkins: Jena_Core #239
Date Thu, 28 Jun 2012 13:31:26 GMT
See <https://builds.apache.org/job/Jena_Core/239/changes>

Changes:

[andy] [maven-release-plugin] prepare for next development iteration

[andy] [maven-release-plugin] prepare release jena-2.7.2

------------------------------------------
Started by an SCM change
Building remotely on ubuntu4 in workspace <https://builds.apache.org/job/Jena_Core/ws/>
Cleaning up <https://builds.apache.org/job/Jena_Core/ws/jena-core>
Deleting <https://builds.apache.org/job/Jena_Core/ws/jena-core/target>
Updating http://svn.apache.org/repos/asf/jena/trunk/jena-core
D         .project
D         .classpath
D         .settings
U         pom.xml
 U        .
At revision 1355009
Parsing POMs
Failed to transfer Could not find metadata org.apache.jena:jena-parent:3-SNAPSHOT/maven-metadata.xml
in Nexus (http://repository.apache.org/snapshots)
Failed to transfer Could not find artifact org.apache.jena:jena-parent:pom:3-SNAPSHOT in Nexus
(http://repository.apache.org/snapshots)
ERROR: Failed to parse POMs
hudson.util.IOException2: remote file operation failed: <https://builds.apache.org/job/Jena_Core/ws/jena-core>
at hudson.remoting.Channel@29b7fe65:ubuntu4
	at hudson.FilePath.act(FilePath.java:838)
	at hudson.FilePath.act(FilePath.java:824)
	at hudson.maven.MavenModuleSetBuild$MavenModuleSetBuildExecution.parsePoms(MavenModuleSetBuild.java:910)
	at hudson.maven.MavenModuleSetBuild$MavenModuleSetBuildExecution.doRun(MavenModuleSetBuild.java:654)
	at hudson.model.AbstractBuild$AbstractBuildExecution.run(AbstractBuild.java:499)
	at hudson.model.Run.execute(Run.java:1488)
	at hudson.maven.MavenModuleSetBuild.run(MavenModuleSetBuild.java:477)
	at hudson.model.ResourceController.execute(ResourceController.java:88)
	at hudson.model.Executor.run(Executor.java:236)
Caused by: hudson.remoting.ProxyException: hudson.maven.MavenModuleSetBuild$MavenExecutionException:
org.apache.maven.project.ProjectBuildingException: Some problems were encountered while processing
the POMs:
[FATAL] Non-resolvable parent POM: Could not find artifact org.apache.jena:jena-parent:pom:3-SNAPSHOT
in Nexus (http://repository.apache.org/snapshots) and 'parent.relativePath' points at wrong
local POM @ line 27, column 11

	at hudson.maven.MavenModuleSetBuild$PomParser.invoke(MavenModuleSetBuild.java:1277)
	at hudson.maven.MavenModuleSetBuild$PomParser.invoke(MavenModuleSetBuild.java:1045)
	at hudson.FilePath$FileCallableWrapper.call(FilePath.java:2196)
	at hudson.remoting.UserRequest.perform(UserRequest.java:118)
	at hudson.remoting.UserRequest.perform(UserRequest.java:48)
	at hudson.remoting.Request$2.run(Request.java:326)
	at hudson.remoting.InterceptingExecutorService$1.call(InterceptingExecutorService.java:72)
	at java.util.concurrent.FutureTask$Sync.innerRun(FutureTask.java:334)
	at java.util.concurrent.FutureTask.run(FutureTask.java:166)
	at java.util.concurrent.ThreadPoolExecutor.runWorker(ThreadPoolExecutor.java:1110)
	at java.util.concurrent.ThreadPoolExecutor$Worker.run(ThreadPoolExecutor.java:603)
	at java.lang.Thread.run(Thread.java:636)
Caused by: hudson.remoting.ProxyException: org.apache.maven.project.ProjectBuildingException:
Some problems were encountered while processing the POMs:
[FATAL] Non-resolvable parent POM: Could not find artifact org.apache.jena:jena-parent:pom:3-SNAPSHOT
in Nexus (http://repository.apache.org/snapshots) and 'parent.relativePath' points at wrong
local POM @ line 27, column 11

	at org.apache.maven.project.DefaultProjectBuilder.build(DefaultProjectBuilder.java:363)
	at hudson.maven.MavenEmbedder.buildProjects(MavenEmbedder.java:361)
	at hudson.maven.MavenEmbedder.readProjects(MavenEmbedder.java:331)
	at hudson.maven.MavenModuleSetBuild$PomParser.invoke(MavenModuleSetBuild.java:1227)
	... 11 more

Mime
View raw message