jena-commits mailing list archives

Site index · List index
Message view « Date » · « Thread »
Top « Date » · « Thread »
From Apache Jenkins Server <jenk...@builds.apache.org>
Subject Build failed in Jenkins: Jena_LARQ #470
Date Wed, 27 Jun 2012 05:17:25 GMT
See <https://builds.apache.org/job/Jena_LARQ/470/>

------------------------------------------
[...truncated 46 lines...]
[INFO] --- maven-resources-plugin:2.5:testResources (default-testResources) @ jena-larq ---
[INFO] Copying 23 resources
[INFO] Copying 3 resources
mojoSucceeded org.apache.maven.plugins:maven-resources-plugin:2.5(default-testResources)
mojoStarted org.apache.maven.plugins:maven-compiler-plugin:2.4(default-testCompile)
[INFO] 
[INFO] --- maven-compiler-plugin:2.4:testCompile (default-testCompile) @ jena-larq ---
[INFO] Compiling 17 source files to <https://builds.apache.org/job/Jena_LARQ/ws/jena-larq/target/test-classes>
mojoSucceeded org.apache.maven.plugins:maven-compiler-plugin:2.4(default-testCompile)
mojoStarted org.apache.maven.plugins:maven-surefire-plugin:2.12(default-test)
[INFO] 
[INFO] --- maven-surefire-plugin:2.12:test (default-test) @ jena-larq ---
[INFO] Surefire report directory: <https://builds.apache.org/job/Jena_LARQ/ws/jena-larq/target/surefire-reports>

-------------------------------------------------------
 T E S T S
-------------------------------------------------------
Running org.apache.jena.larq.TS_LARQ
Tests run: 66, Failures: 0, Errors: 0, Skipped: 0, Time elapsed: 3.257 sec

Results :

Tests run: 66, Failures: 0, Errors: 0, Skipped: 0

mojoSucceeded org.apache.maven.plugins:maven-surefire-plugin:2.12(default-test)
[JENKINS] Recording test results
mojoStarted org.apache.maven.plugins:maven-jar-plugin:2.4(default-jar)
[INFO] 
[INFO] --- maven-jar-plugin:2.4:jar (default-jar) @ jena-larq ---
[INFO] Building jar: <https://builds.apache.org/job/Jena_LARQ/ws/jena-larq/target/jena-larq-1.0.1-SNAPSHOT.jar>
mojoSucceeded org.apache.maven.plugins:maven-jar-plugin:2.4(default-jar)
mojoStarted org.apache.maven.plugins:maven-site-plugin:3.0(attach-descriptor)
[INFO] 
[INFO] --- maven-site-plugin:3.0:attach-descriptor (attach-descriptor) @ jena-larq ---
mojoSucceeded org.apache.maven.plugins:maven-site-plugin:3.0(attach-descriptor)
mojoStarted org.apache.maven.plugins:maven-source-plugin:2.1.2(attach-sources)
[INFO] 
[INFO] --- maven-source-plugin:2.1.2:jar-no-fork (attach-sources) @ jena-larq ---
[INFO] META-INF already added, skipping
[INFO] META-INF already added, skipping
[INFO] META-INF/NOTICE already added, skipping
[INFO] META-INF/DEPENDENCIES already added, skipping
[INFO] META-INF/LICENSE already added, skipping
[INFO] Building jar: <https://builds.apache.org/job/Jena_LARQ/ws/jena-larq/target/jena-larq-1.0.1-SNAPSHOT-sources.jar>
[INFO] META-INF already added, skipping
[INFO] META-INF already added, skipping
[INFO] META-INF/NOTICE already added, skipping
[INFO] META-INF/DEPENDENCIES already added, skipping
[INFO] META-INF/LICENSE already added, skipping
mojoSucceeded org.apache.maven.plugins:maven-source-plugin:2.1.2(attach-sources)
mojoStarted org.apache.maven.plugins:maven-javadoc-plugin:2.8.1(attach-javadocs)
[INFO] 
[INFO] --- maven-javadoc-plugin:2.8.1:jar (attach-javadocs) @ jena-larq ---
[INFO] Building jar: <https://builds.apache.org/job/Jena_LARQ/ws/jena-larq/target/jena-larq-1.0.1-SNAPSHOT-javadoc.jar>
mojoSucceeded org.apache.maven.plugins:maven-javadoc-plugin:2.8.1(attach-javadocs)
mojoStarted org.apache.maven.plugins:maven-install-plugin:2.3.1(default-install)[INFO] Installing
<https://builds.apache.org/job/Jena_LARQ/ws/jena-larq/target/jena-larq-1.0.1-SNAPSHOT.jar>
to /home/jenkins/jenkins-slave/maven-repositories/0/org/apache/jena/jena-larq/1.0.1-SNAPSHOT/jena-larq-1.0.1-SNAPSHOT.jar

[INFO] 
[INFO] --- maven-install-plugin:2.3.1:install (default-install) @ jena-larq ---
[INFO] Installing <https://builds.apache.org/job/Jena_LARQ/ws/jena-larq/pom.xml> to
/home/jenkins/jenkins-slave/maven-repositories/0/org/apache/jena/jena-larq/1.0.1-SNAPSHOT/jena-larq-1.0.1-SNAPSHOT.pom
[INFO] Installing <https://builds.apache.org/job/Jena_LARQ/ws/jena-larq/target/jena-larq-1.0.1-SNAPSHOT-sources.jar>
to /home/jenkins/jenkins-slave/maven-repositories/0/org/apache/jena/jena-larq/1.0.1-SNAPSHOT/jena-larq-1.0.1-SNAPSHOT-sources.jar
[INFO] Installing <https://builds.apache.org/job/Jena_LARQ/ws/jena-larq/target/jena-larq-1.0.1-SNAPSHOT-javadoc.jar>
to /home/jenkins/jenkins-slave/maven-repositories/0/org/apache/jena/jena-larq/1.0.1-SNAPSHOT/jena-larq-1.0.1-SNAPSHOT-javadoc.jar
mojoSucceeded org.apache.maven.plugins:maven-install-plugin:2.3.1(default-install)
mojoStarted org.codehaus.mojo:findbugs-maven-plugin:2.5(default-cli)
[INFO] 
[INFO] --- findbugs-maven-plugin:2.5:findbugs (default-cli) @ jena-larq ---
[INFO] Fork Value is true
     [java] Warnings generated: 6
[INFO] Done FindBugs Analysis....
mojoSucceeded org.codehaus.mojo:findbugs-maven-plugin:2.5(default-cli)
[FINDBUGS] Parsing 1 files in <https://builds.apache.org/job/Jena_LARQ/ws/jena-larq/target>
[FINDBUGS] Successfully parsed file <https://builds.apache.org/job/Jena_LARQ/ws/jena-larq/target/findbugsXml.xml>
of module LARQ with 6 warnings.
[FINDBUGS] Computing warning deltas based on reference build #469
[JENKINS] Configuring cobertura-maven-plugin to enable xml reports
forkedProjectStarted org.apache.jena:jena-larq:1.0.1-SNAPSHOT
mojoStarted org.apache.maven.plugins:maven-remote-resources-plugin:1.2.1(default)
[INFO] 
[INFO] --- maven-remote-resources-plugin:1.2.1:process (default) @ jena-larq ---
mojoSucceeded org.apache.maven.plugins:maven-remote-resources-plugin:1.2.1(default)
mojoStarted org.apache.maven.plugins:maven-resources-plugin:2.5(default-resources)[debug]
execute contextualize
[INFO] Using 'UTF-8' encoding to copy filtered resources.
[INFO] Copying 0 resource
[INFO] Copying 3 resources
[INFO] Copying 3 resources

[INFO] 
[INFO] --- maven-resources-plugin:2.5:resources (default-resources) @ jena-larq ---
mojoSucceeded org.apache.maven.plugins:maven-resources-plugin:2.5(default-resources)
mojoStarted org.apache.maven.plugins:maven-compiler-plugin:2.4(default-compile)[INFO] Nothing
to compile - all classes are up to date

[INFO] 
[INFO] --- maven-compiler-plugin:2.4:compile (default-compile) @ jena-larq ---
mojoSucceeded org.apache.maven.plugins:maven-compiler-plugin:2.4(default-compile)
mojoStarted org.codehaus.mojo:cobertura-maven-plugin:2.5.1(default-cli)
[INFO] 
[INFO] --- cobertura-maven-plugin:2.5.1:instrument (default-cli) @ jena-larq ---
[INFO] Cobertura 1.9.4.1 - GNU GPL License (NO WARRANTY) - See COPYRIGHT file
Instrumenting 25 files to <https://builds.apache.org/job/Jena_LARQ/ws/jena-larq/target/generated-classes/cobertura>
Cobertura: Saved information on 25 classes.
Instrument time: 254ms

[INFO] Instrumentation was successful.
[INFO] NOT adding cobertura ser file to attached artifacts list.
mojoSucceeded org.codehaus.mojo:cobertura-maven-plugin:2.5.1(default-cli)
mojoStarted org.apache.maven.plugins:maven-resources-plugin:2.5(default-testResources)[debug]
execute contextualize
[INFO] Using 'UTF-8' encoding to copy filtered resources.
[INFO] Copying 23 resources
[INFO] Copying 3 resources
[INFO] Copying 3 resources

[INFO] 
[INFO] --- maven-resources-plugin:2.5:testResources (default-testResources) @ jena-larq ---
mojoSucceeded org.apache.maven.plugins:maven-resources-plugin:2.5(default-testResources)
mojoStarted org.apache.maven.plugins:maven-compiler-plugin:2.4(default-testCompile)[INFO]
Nothing to compile - all classes are up to date

[INFO] 
[INFO] --- maven-compiler-plugin:2.4:testCompile (default-testCompile) @ jena-larq ---
mojoSucceeded org.apache.maven.plugins:maven-compiler-plugin:2.4(default-testCompile)
mojoStarted org.apache.maven.plugins:maven-surefire-plugin:2.12(default-test)[INFO] Surefire
report directory: <https://builds.apache.org/job/Jena_LARQ/ws/jena-larq/target/surefire-reports>

-------------------------------------------------------
 T E S T S
-------------------------------------------------------

[INFO] 
[INFO] --- maven-surefire-plugin:2.12:test (default-test) @ jena-larq ---
Running org.apache.jena.larq.TS_LARQ
Tests run: 66, Failures: 0, Errors: 0, Skipped: 0, Time elapsed: 5.216 sec
Flushing results...
Flushing results done
Cobertura: Loaded information on 25 classes.
Cobertura: Saved information on 25 classes.

Results :

Tests run: 66, Failures: 0, Errors: 0, Skipped: 0

mojoSucceeded org.apache.maven.plugins:maven-surefire-plugin:2.12(default-test)
[JENKINS] Recording test results
forkedProjectSucceeded org.apache.jena:jena-larq:1.0.1-SNAPSHOT
mojoStarted org.codehaus.mojo:cobertura-maven-plugin:2.5.1(default-cli)
[JENKINS] cobertura-maven-plugin already configured with xml reports enabled
[INFO] 
[INFO] --- cobertura-maven-plugin:2.5.1:cobertura (default-cli) @ jena-larq ---
[INFO] Cobertura 1.9.4.1 - GNU GPL License (NO WARRANTY) - See COPYRIGHT file
Cobertura: Loaded information on 25 classes.
Report time: 664ms

[INFO] Cobertura Report generation was successful.
mojoSucceeded org.codehaus.mojo:cobertura-maven-plugin:2.5.1(default-cli)
[JENKINS] Recording coverage results
mojoStarted org.apache.maven.plugins:maven-pmd-plugin:2.7.1(default-cli)
[INFO] 
[INFO] --- maven-pmd-plugin:2.7.1:pmd (default-cli) @ jena-larq ---
mojoSucceeded org.apache.maven.plugins:maven-pmd-plugin:2.7.1(default-cli)
[PMD] Parsing 1 files in <https://builds.apache.org/job/Jena_LARQ/ws/jena-larq/target>
[PMD] Successfully parsed file <https://builds.apache.org/job/Jena_LARQ/ws/jena-larq/target/pmd.xml>
of module LARQ with 0 warnings.
[PMD] Computing warning deltas based on reference build #469
projectSucceeded org.apache.jena:jena-larq:1.0.1-SNAPSHOT
projectFailed org.apache.jena:jena-larq:1.0.1-SNAPSHOT
sessionEnded
[INFO] ------------------------------------------------------------------------
[INFO] BUILD FAILURE
[INFO] ------------------------------------------------------------------------
[INFO] Total time: 2:06.669s
[INFO] Finished at: Wed Jun 27 05:17:19 UTC 2012
[INFO] Final Memory: 34M/72M
[INFO] ------------------------------------------------------------------------
Projects to build: [MavenProject: org.apache.jena:jena-larq:1.0.1-SNAPSHOT @ <https://builds.apache.org/job/Jena_LARQ/ws/jena-larq/pom.xml]>
[JENKINS] Archiving <https://builds.apache.org/job/Jena_LARQ/ws/jena-larq/pom.xml> to
/home/hudson/hudson/jobs/Jena_LARQ/modules/org.apache.jena$jena-larq/builds/2012-06-27_05-14-57/archive/org.apache.jena/jena-larq/1.0.1-SNAPSHOT/jena-larq-1.0.1-SNAPSHOT.pom
[JENKINS] Archiving <https://builds.apache.org/job/Jena_LARQ/ws/jena-larq/target/jena-larq-1.0.1-SNAPSHOT.jar>
to /home/hudson/hudson/jobs/Jena_LARQ/modules/org.apache.jena$jena-larq/builds/2012-06-27_05-14-57/archive/org.apache.jena/jena-larq/1.0.1-SNAPSHOT/jena-larq-1.0.1-SNAPSHOT.jar
[JENKINS] Archiving <https://builds.apache.org/job/Jena_LARQ/ws/jena-larq/target/jena-larq-1.0.1-SNAPSHOT-sources.jar>
to /home/hudson/hudson/jobs/Jena_LARQ/modules/org.apache.jena$jena-larq/builds/2012-06-27_05-14-57/archive/org.apache.jena/jena-larq/1.0.1-SNAPSHOT/jena-larq-1.0.1-SNAPSHOT-sources.jar
[JENKINS] Archiving <https://builds.apache.org/job/Jena_LARQ/ws/jena-larq/target/jena-larq-1.0.1-SNAPSHOT-javadoc.jar>
to /home/hudson/hudson/jobs/Jena_LARQ/modules/org.apache.jena$jena-larq/builds/2012-06-27_05-14-57/archive/org.apache.jena/jena-larq/1.0.1-SNAPSHOT/jena-larq-1.0.1-SNAPSHOT-javadoc.jar
Waiting for Jenkins to finish collecting data
mavenExecutionResult exceptions not empty
message : Internal error: java.lang.reflect.UndeclaredThrowableException
cause : null
Stack trace : 
org.apache.maven.InternalErrorException: Internal error: java.lang.reflect.UndeclaredThrowableException
	at org.apache.maven.lifecycle.internal.BuilderCommon.handleBuildError(BuilderCommon.java:128)
	at org.apache.maven.lifecycle.internal.LifecycleModuleBuilder.buildProject(LifecycleModuleBuilder.java:95)
	at org.apache.maven.lifecycle.internal.LifecycleModuleBuilder.buildProject(LifecycleModuleBuilder.java:59)
	at org.apache.maven.lifecycle.internal.LifecycleStarter.singleThreadedBuild(LifecycleStarter.java:183)
	at org.apache.maven.lifecycle.internal.LifecycleStarter.execute(LifecycleStarter.java:161)
	at org.apache.maven.DefaultMaven.doExecute(DefaultMaven.java:319)
	at org.apache.maven.DefaultMaven.execute(DefaultMaven.java:156)
	at org.jvnet.hudson.maven3.launcher.Maven3Launcher.main(Maven3Launcher.java:79)
	at sun.reflect.NativeMethodAccessorImpl.invoke0(Native Method)
	at sun.reflect.NativeMethodAccessorImpl.invoke(NativeMethodAccessorImpl.java:39)
	at sun.reflect.DelegatingMethodAccessorImpl.invoke(DelegatingMethodAccessorImpl.java:25)
	at java.lang.reflect.Method.invoke(Method.java:597)
	at org.codehaus.plexus.classworlds.launcher.Launcher.launchStandard(Launcher.java:329)
	at org.codehaus.plexus.classworlds.launcher.Launcher.launch(Launcher.java:239)
	at org.jvnet.hudson.maven3.agent.Maven3Main.launch(Maven3Main.java:158)
	at hudson.maven.Maven3Builder.call(Maven3Builder.java:98)
	at hudson.maven.Maven3Builder.call(Maven3Builder.java:64)
	at hudson.remoting.UserRequest.perform(UserRequest.java:118)
	at hudson.remoting.UserRequest.perform(UserRequest.java:48)
	at hudson.remoting.Request$2.run(Request.java:326)
	at hudson.remoting.InterceptingExecutorService$1.call(InterceptingExecutorService.java:72)
	at java.util.concurrent.FutureTask$Sync.innerRun(FutureTask.java:303)
	at java.util.concurrent.FutureTask.run(FutureTask.java:138)
	at java.util.concurrent.ThreadPoolExecutor$Worker.runTask(ThreadPoolExecutor.java:886)
	at java.util.concurrent.ThreadPoolExecutor$Worker.run(ThreadPoolExecutor.java:908)
	at java.lang.Thread.run(Thread.java:662)
Caused by: java.lang.reflect.UndeclaredThrowableException
	at $Proxy2.end(Unknown Source)
	at hudson.maven.MavenBuildProxy2$Filter.end(MavenBuildProxy2.java:74)
	at hudson.maven.Maven3Builder$MavenExecutionListener.recordProjectEnded(Maven3Builder.java:357)
	at hudson.maven.Maven3Builder$MavenExecutionListener.projectSucceeded(Maven3Builder.java:328)
	at org.apache.maven.lifecycle.internal.DefaultExecutionEventCatapult.fire(DefaultExecutionEventCatapult.java:74)
	at org.apache.maven.lifecycle.internal.DefaultExecutionEventCatapult.fire(DefaultExecutionEventCatapult.java:42)
	at org.apache.maven.lifecycle.internal.LifecycleModuleBuilder.buildProject(LifecycleModuleBuilder.java:91)
	... 24 more
Caused by: java.io.IOException: Remote call on channel failed
	at hudson.remoting.Channel.call(Channel.java:672)
	at hudson.remoting.RemoteInvocationHandler.invoke(RemoteInvocationHandler.java:158)
	... 31 more
Caused by: java.lang.NoSuchMethodError: hudson.plugins.analysis.core.BuildResultEvaluator:
method <init>()V not found
	at hudson.plugins.analysis.core.BuildResult.evaluateStatus(BuildResult.java:1072)
	at hudson.plugins.analysis.core.BuildResult.evaluateStatus(BuildResult.java:1047)
	at hudson.plugins.analysis.core.MavenResultAction.createAggregatedResult(MavenResultAction.java:126)
	at hudson.plugins.analysis.core.MavenResultAction.update(MavenResultAction.java:105)
	at hudson.maven.MavenModuleSetBuild.notifyModuleBuild(MavenModuleSetBuild.java:525)
	at hudson.maven.MavenBuild$ProxyImpl2.end(MavenBuild.java:491)
	at sun.reflect.GeneratedMethodAccessor559.invoke(Unknown Source)
	at sun.reflect.DelegatingMethodAccessorImpl.invoke(DelegatingMethodAccessorImpl.java:43)
	at java.lang.reflect.Method.invoke(Method.java:601)
	at hudson.model.Executor$1.call(Executor.java:531)
	at hudson.util.InterceptingProxy$1.invoke(InterceptingProxy.java:23)
	at $Proxy45.end(Unknown Source)
	at sun.reflect.GeneratedMethodAccessor558.invoke(Unknown Source)
	at sun.reflect.DelegatingMethodAccessorImpl.invoke(DelegatingMethodAccessorImpl.java:43)
	at java.lang.reflect.Method.invoke(Method.java:601)
	at hudson.remoting.RemoteInvocationHandler$RPCRequest.perform(RemoteInvocationHandler.java:274)
	at hudson.remoting.RemoteInvocationHandler$RPCRequest.call(RemoteInvocationHandler.java:255)
	at hudson.remoting.RemoteInvocationHandler$RPCRequest.call(RemoteInvocationHandler.java:215)
	at hudson.remoting.UserRequest.perform(UserRequest.java:118)
	at hudson.remoting.UserRequest.perform(UserRequest.java:48)
	at hudson.remoting.Request$2.run(Request.java:326)
	at hudson.remoting.InterceptingExecutorService$1.call(InterceptingExecutorService.java:72)
	at java.util.concurrent.FutureTask$Sync.innerRun(FutureTask.java:334)
	at java.util.concurrent.FutureTask.run(FutureTask.java:166)
	at java.util.concurrent.ThreadPoolExecutor.runWorker(ThreadPoolExecutor.java:1110)
	at java.util.concurrent.ThreadPoolExecutor$Worker.run(ThreadPoolExecutor.java:603)
	at java.lang.Thread.run(Thread.java:722)
Sending e-mails to: commits@jena.apache.org
channel stopped
Skipping Cobertura coverage report as build was not UNSTABLE or better ...

Mime
View raw message