jena-commits mailing list archives

Site index · List index
Message view « Date » · « Thread »
Top « Date » · « Thread »
From Apache Jenkins Server <jenk...@builds.apache.org>
Subject Build failed in Jenkins: Jena_TDB » jena-tdb #646
Date Thu, 31 May 2012 09:26:43 GMT
See <https://builds.apache.org/job/Jena_TDB/org.apache.jena$jena-tdb/646/changes>

Changes:

[andy] Add request object to start/finish of SPARQL updates

------------------------------------------
<===[JENKINS REMOTING CAPACITY]===>channel started
   log4j:WARN No appenders could be found for logger (org.apache.commons.beanutils.converters.BooleanConverter).
log4j:WARN Please initialize the log4j system properly.
Executing Maven:  -B -f <https://builds.apache.org/job/Jena_TDB/org.apache.jena$jena-tdb/ws/pom.xml>
-Dmaven.repo.local=/home/jenkins/jenkins-slave/maven-repositories/1 clean install
[INFO] Scanning for projects...
Projects to build: [MavenProject: org.apache.jena:jena-tdb:0.9.1-SNAPSHOT @ <https://builds.apache.org/job/Jena_TDB/org.apache.jena$jena-tdb/ws/pom.xml]>
projectStarted org.apache.jena:jena-tdb:0.9.1-SNAPSHOT
[INFO]                                                                         
[INFO] ------------------------------------------------------------------------
[INFO] Building jena-tdb 0.9.1-SNAPSHOT
[INFO] ------------------------------------------------------------------------
Downloading: http://repository.apache.org/snapshots/org/apache/jena/jena-arq/2.9.1-SNAPSHOT/maven-metadata.xml
Downloaded: http://repository.apache.org/snapshots/org/apache/jena/jena-arq/2.9.1-SNAPSHOT/maven-metadata.xml
(2 KB at 2.1 KB/sec)
Downloading: http://repository.apache.org/snapshots/org/apache/jena/jena-arq/2.9.1-SNAPSHOT/jena-arq-2.9.1-20120531.050531-17.pom
Downloaded: http://repository.apache.org/snapshots/org/apache/jena/jena-arq/2.9.1-SNAPSHOT/jena-arq-2.9.1-20120531.050531-17.pom
(8 KB at 45.8 KB/sec)
Downloading: http://repository.apache.org/snapshots/org/apache/jena/jena-core/2.7.1-SNAPSHOT/maven-metadata.xml
Downloaded: http://repository.apache.org/snapshots/org/apache/jena/jena-core/2.7.1-SNAPSHOT/maven-metadata.xml
(2 KB at 1.0 KB/sec)
Downloading: http://repository.apache.org/snapshots/org/apache/jena/jena-core/2.7.1-SNAPSHOT/jena-core-2.7.1-20120531.050439-11.pom
Downloaded: http://repository.apache.org/snapshots/org/apache/jena/jena-core/2.7.1-SNAPSHOT/jena-core-2.7.1-20120531.050439-11.pom
(9 KB at 44.9 KB/sec)
Downloading: http://repository.apache.org/snapshots/org/apache/jena/jena-iri/0.9.1-SNAPSHOT/maven-metadata.xml
Downloaded: http://repository.apache.org/snapshots/org/apache/jena/jena-iri/0.9.1-SNAPSHOT/maven-metadata.xml
(2 KB at 3.1 KB/sec)
Downloading: http://repository.apache.org/snapshots/org/apache/jena/jena-iri/0.9.1-SNAPSHOT/jena-iri-0.9.1-20120531.050320-8.pom
Downloaded: http://repository.apache.org/snapshots/org/apache/jena/jena-iri/0.9.1-SNAPSHOT/jena-iri-0.9.1-20120531.050320-8.pom
(6 KB at 39.1 KB/sec)
Downloading: http://repository.apache.org/snapshots/org/apache/jena/jena-arq/2.9.1-SNAPSHOT/jena-arq-2.9.1-20120531.050531-17.jar
Downloading: http://repository.apache.org/snapshots/org/apache/jena/jena-arq/2.9.1-SNAPSHOT/jena-arq-2.9.1-20120531.050531-17-tests.jar
Downloading: http://repository.apache.org/snapshots/org/apache/jena/jena-iri/0.9.1-SNAPSHOT/jena-iri-0.9.1-20120531.050320-8.jar
Downloading: http://repository.apache.org/snapshots/org/apache/jena/jena-core/2.7.1-SNAPSHOT/jena-core-2.7.1-20120531.050439-11.jar
Downloading: http://repository.apache.org/snapshots/org/apache/jena/jena-core/2.7.1-SNAPSHOT/jena-core-2.7.1-20120531.050439-11-tests.jar
mojoStarted org.apache.maven.plugins:maven-clean-plugin:2.4.1(default-clean)Downloaded: http://repository.apache.org/snapshots/org/apache/jena/jena-iri/0.9.1-SNAPSHOT/jena-iri-0.9.1-20120531.050320-8.jar
(134 KB at 177.0 KB/sec)
Downloaded: http://repository.apache.org/snapshots/org/apache/jena/jena-arq/2.9.1-SNAPSHOT/jena-arq-2.9.1-20120531.050531-17-tests.jar
(405 KB at 366.9 KB/sec)
Downloaded: http://repository.apache.org/snapshots/org/apache/jena/jena-core/2.7.1-SNAPSHOT/jena-core-2.7.1-20120531.050439-11-tests.jar
(1464 KB at 1224.8 KB/sec)
Downloaded: http://repository.apache.org/snapshots/org/apache/jena/jena-arq/2.9.1-SNAPSHOT/jena-arq-2.9.1-20120531.050531-17.jar
(2284 KB at 1841.7 KB/sec)
Downloaded: http://repository.apache.org/snapshots/org/apache/jena/jena-core/2.7.1-SNAPSHOT/jena-core-2.7.1-20120531.050439-11.jar
(1687 KB at 1148.1 KB/sec)

[INFO] 
[INFO] --- maven-clean-plugin:2.4.1:clean (default-clean) @ jena-tdb ---
mojoSucceeded org.apache.maven.plugins:maven-clean-plugin:2.4.1(default-clean)
mojoStarted org.apache.maven.plugins:maven-remote-resources-plugin:1.2.1(default)
[INFO] 
[INFO] --- maven-remote-resources-plugin:1.2.1:process (default) @ jena-tdb ---
mojoSucceeded org.apache.maven.plugins:maven-remote-resources-plugin:1.2.1(default)
mojoStarted org.apache.maven.plugins:maven-resources-plugin:2.5(default-resources)[debug]
execute contextualize

[INFO] 
[INFO] --- maven-resources-plugin:2.5:resources (default-resources) @ jena-tdb ---
[INFO] Using 'UTF-8' encoding to copy filtered resources.
[INFO] Copying 0 resource
[INFO] Copying 1 resource
[INFO] Copying 3 resources
mojoSucceeded org.apache.maven.plugins:maven-resources-plugin:2.5(default-resources)
mojoStarted org.apache.maven.plugins:maven-compiler-plugin:2.4(default-compile)
[INFO] 
[INFO] --- maven-compiler-plugin:2.4:compile (default-compile) @ jena-tdb ---
[INFO] Compiling 292 source files to <https://builds.apache.org/job/Jena_TDB/org.apache.jena$jena-tdb/ws/target/classes>
[INFO] -------------------------------------------------------------
[ERROR] COMPILATION ERROR : 
[INFO] -------------------------------------------------------------
[ERROR] <https://builds.apache.org/job/Jena_TDB/org.apache.jena$jena-tdb/ws/src/main/java/com/hp/hpl/jena/tdb/store/DatasetGraphTDB.java>:[295,4]
method does not override or implement a method from a supertype
[ERROR] <https://builds.apache.org/job/Jena_TDB/org.apache.jena$jena-tdb/ws/src/main/java/com/hp/hpl/jena/tdb/store/DatasetGraphTDB.java>:[299,4]
method does not override or implement a method from a supertype
[INFO] 2 errors 
[INFO] -------------------------------------------------------------
mojoFailed org.apache.maven.plugins:maven-compiler-plugin:2.4(default-compile)
projectFailed org.apache.jena:jena-tdb:0.9.1-SNAPSHOT

Mime
View raw message