jena-commits mailing list archives

Site index · List index
Message view « Date » · « Thread »
Top « Date » · « Thread »
From Apache Jenkins Server <jenk...@builds.apache.org>
Subject Build failed in Jenkins: Jena_SDB #280
Date Sun, 13 May 2012 15:16:50 GMT
See <https://builds.apache.org/job/Jena_SDB/280/changes>

Changes:

[andy] Remove 'incubating' from version; Use jena-parent

------------------------------------------
[...truncated 738 lines...]
A         PerfTests/SQL/ex1a-1.sql
A         PerfTests/SQL/ex1a-alt.sql
A         PerfTests/SQL/sdb.ttl
A         PerfTests/SQL/ex1a-2.sql
A         PerfTests/SQL/ex1a.sql
A         PerfTests/UniProt
A         PerfTests/UniProt/sdb-index.ttl
A         PerfTests/UniProt/query-2006-03-06_files
AU        PerfTests/UniProt/query-2006-03-06_files/logo.png
AU        PerfTests/UniProt/query-2006-03-06_files/default.css
A         PerfTests/UniProt/Experiment1.txt
A         PerfTests/UniProt/ex1a.rq
AU        PerfTests/UniProt/ex2.rq
A         PerfTests/UniProt/ex2a.rq
AU        PerfTests/UniProt/ex3.rq
A         PerfTests/UniProt/ex3a.rq
AU        PerfTests/UniProt/ex4.rq
A         PerfTests/UniProt/ex4a.rq
AU        PerfTests/UniProt/ex5.rq
A         PerfTests/UniProt/ex5a.rq
AU        PerfTests/UniProt/ex6.rq
AU        PerfTests/UniProt/query-2006-03-06.htm
A         PerfTests/UniProt/ex6a.rq
AU        PerfTests/UniProt/ex7.rq
A         PerfTests/UniProt/ex7a.rq
AU        PerfTests/UniProt/ex8.rq
AU        PerfTests/UniProt/ex9.rq
AU        PerfTests/UniProt/ex9a.rq
AU        PerfTests/UniProt/validate
A         PerfTests/UniProt/sdb-hash.ttl
A         PerfTests/UniProt/run_all
AU        PerfTests/UniProt/Notes.txt
A         PerfTests/UniProt/manifest.rb
AU        PerfTests/UniProt/sdb.ttl
AU        PerfTests/UniProt/ex1.rq
A         PerfTests/SwetoDlp
AU        PerfTests/SwetoDlp/Notes.txt
A         PerfTests/BartonLibraries
AU        PerfTests/BartonLibraries/notes.txt
A         PerfTests/WordNet
A         PerfTests/WordNet/sdb-index.ttl
A         PerfTests/WordNet/Q1.rq
A         PerfTests/WordNet/Q2.rq
A         PerfTests/WordNet/manifest.rb
AU        PerfTests/WordNet/wn20basic.zip
A         PerfTests/WordNet/sdb.ttl
AU        PerfTests/WordNet/wn20full.zip
A         PerfTests/WordNet/README.txt
A         PerfTests/WordNet/sdb-hash.ttl
A         PerfTests/lib
A         PerfTests/lib/query_test.rb
A         PerfTests/dbpedia
A         PerfTests/dbpedia/sdb-index.ttl
A         PerfTests/dbpedia/Q1.rq
A         PerfTests/dbpedia/Q2.rq
A         PerfTests/dbpedia/Q3.rq
A         PerfTests/dbpedia/Q4.rq
A         PerfTests/dbpedia/Q5.rq
A         PerfTests/dbpedia/Q6.rq
A         PerfTests/dbpedia/Q7.rq
A         PerfTests/dbpedia/manifest.rb
A         PerfTests/dbpedia/sdb-hash.ttl
A         PerfTests/dbpedia/README
A         Vocabularies
AU        Vocabularies/build
AU        Vocabularies/schema-config.ttl
A         Vocabularies/cmd-vocab.ttl
A         NOTICE
A         LICENSE
A         Patches
AU        Patches/patch_sdb.txt
A         bin2
AU        bin2/sdbmeta
AU        bin2/sdbtuple
AU        bin2/sdbinfo
AU        bin2/sdbprint
AU        bin2/sdbload
AU        bin2/sdbsql
AU        bin2/sdbtest
AU        bin2/sdbdelete
AU        bin2/sdbscript
AU        bin2/sdbconfig
AU        bin2/sdbdump
AU        bin2/sdbquery
AU        bin2/sdbtruncate
A         Reports
A         Reports/explain.rb
A         Reports/jdbc.rb
A         Reports/databases.rb
A         Reports/format.rb
A         src-dev
A         src-dev/dbtest
AU        src-dev/dbtest/Setup.java
AU        src-dev/dbtest/Params.java
AU        src-dev/dbtest/TestBinary.java
AU        src-dev/dbtest/TestLongText.java
AU        src-dev/dbtest/TestShortText.java
AU        src-dev/dbtest/DB.java
AU        src-dev/dbtest/TestDB.java
AU        src-dev/dbtest/dbsetuptest.java
AU        src-dev/dbtest/ParamsVocab.java
A         src-dev/dev
A         src-dev/dev/pldms
A         src-dev/dev/pldms/Scratch.java
AU        src-dev/dev/ReportSparqlUpdate.java
AU        src-dev/dev/TestStores2Connections1.java
A         src-dev/dev/db
A         src-dev/dev/db/FmtStdHash.java
A         src-dev/dev/db/StoreFormatterStd.java
A         src-dev/dev/db/DBSyntax.java
AU        src-dev/dev/DevSDB.java
A         src-dev/dev/RDB.java
AU        src-dev/dev/RunTests.java
A         src-dev/dev/gen
A         src-dev/dev/inf
A         src-dev/dev/inf/TransGraphNode.java
A         src-dev/dev/inf/sdbRDFSexpand.java
A         src-dev/dev/inf/sdbRDFSload.java
A         src-dev/dev/inf/TransGraph.java
A         src-dev/dev/RunSDB.java
A         src-dev/dev/reports
AU        src-dev/dev/reports/OpenCurosrOracle.java
AU        src-dev/dev/reports/Report_ReifiedStatements.java
A         src-examples
A         src-examples/sdb
A         src-examples/sdb/examples
A         src-examples/sdb/examples/ExJdbcConnection.java
A         src-examples/sdb/examples/ExModelSDB.java
A         src-examples/sdb/examples/Ex1.java
A         src-examples/sdb/examples/Ex2.java
A         ChangeLog.txt
A         Data
AU        Data/data.ttl
AU        Data/data2.ttl
A         resources
A         resources/META-INF
A         resources/META-INF/NOTICE
A         resources/META-INF/LICENSE
A         resources/META-INF/DEPENDENCIES
AU        resources/sdb-properties.xml
A         sdb.ttl
A         README.txt
A         .settings
A         .settings/org.eclipse.jdt.core.prefs
AU        .settings/org.eclipse.jdt.ui.prefs
A         .settings/org.eclipse.ltk.core.refactoring.prefs
 U        .
At revision 1337912
Parsing POMs
Modules changed, recalculating dependency graph
[jena-sdb] $ /home/hudson/tools/java/latest1.6/bin/java -cp /home/jenkins/jenkins-slave/maven3-agent.jar:/home/hudson/tools/maven/latest3/boot/plexus-classworlds-2.4.jar
org.jvnet.hudson.maven3.agent.Maven3Main /home/hudson/tools/maven/latest3 /home/jenkins/jenkins-slave/slave.jar
/home/jenkins/jenkins-slave/maven3-interceptor.jar 36117
<===[JENKINS REMOTING CAPACITY]===>channel started
   log4j:WARN No appenders could be found for logger (org.apache.commons.beanutils.converters.BooleanConverter).
log4j:WARN Please initialize the log4j system properly.
Executing Maven:  -B -f <https://builds.apache.org/job/Jena_SDB/ws/jena-sdb/pom.xml>
-Dmaven.repo.local=/home/jenkins/jenkins-slave/maven-repositories/1 clean install
[INFO] Scanning for projects...
Projects to build: [MavenProject: org.apache.jena:jena-sdb:1.3.4-SNAPSHOT @ <https://builds.apache.org/job/Jena_SDB/ws/jena-sdb/pom.xml]>
projectStarted org.apache.jena:jena-sdb:1.3.4-SNAPSHOT
[INFO]                                                                         
[INFO] ------------------------------------------------------------------------
[INFO] Building jena-sdb 1.3.4-SNAPSHOT
[INFO] ------------------------------------------------------------------------
Downloading: http://repo1.maven.org/maven2/org/apache/jena/jena-core/2.7.0/jena-core-2.7.0.pom
[WARNING] The POM for org.apache.jena:jena-core:jar:2.7.0 is missing, no dependency information
available
Downloading: http://repo1.maven.org/maven2/org/apache/jena/jena-core/2.7.0/jena-core-2.7.0.pom
[WARNING] The POM for org.apache.jena:jena-core:jar:tests:2.7.0 is missing, no dependency
information available
Downloading: http://repo1.maven.org/maven2/org/apache/jena/jena-arq/2.9.0/jena-arq-2.9.0.pom
[WARNING] The POM for org.apache.jena:jena-arq:jar:2.9.0 is missing, no dependency information
available
Downloading: http://repo1.maven.org/maven2/org/apache/jena/jena-arq/2.9.0/jena-arq-2.9.0.pom
[WARNING] The POM for org.apache.jena:jena-arq:jar:tests:2.9.0 is missing, no dependency information
available
Downloading: http://repo1.maven.org/maven2/org/hsqldb/hsqldb/1.8.0.10/hsqldb-1.8.0.10.pom
Downloaded: http://repo1.maven.org/maven2/org/hsqldb/hsqldb/1.8.0.10/hsqldb-1.8.0.10.pom (0
B at 0.0 KB/sec)
Downloading: http://repo1.maven.org/maven2/org/apache/jena/jena-core/2.7.0/jena-core-2.7.0.jar
Downloading: http://repo1.maven.org/maven2/org/apache/jena/jena-core/2.7.0/jena-core-2.7.0-tests.jar
Downloading: http://repo1.maven.org/maven2/org/apache/jena/jena-arq/2.9.0/jena-arq-2.9.0.jar
Downloading: http://repo1.maven.org/maven2/org/hsqldb/hsqldb/1.8.0.10/hsqldb-1.8.0.10.jar
Downloading: http://repo1.maven.org/maven2/org/apache/jena/jena-arq/2.9.0/jena-arq-2.9.0-tests.jar
Downloaded: http://repo1.maven.org/maven2/org/hsqldb/hsqldb/1.8.0.10/hsqldb-1.8.0.10.jar (0
B at 0.0 KB/sec)
projectFailed org.apache.jena:jena-sdb:1.3.4-SNAPSHOT
sessionEnded
[INFO] ------------------------------------------------------------------------
[INFO] BUILD FAILURE
[INFO] ------------------------------------------------------------------------
[INFO] Total time: 4.837s
[INFO] Finished at: Sun May 13 15:16:32 UTC 2012
[INFO] Final Memory: 5M/62M
[INFO] ------------------------------------------------------------------------
Projects to build: [MavenProject: org.apache.jena:jena-sdb:1.3.4-SNAPSHOT @ <https://builds.apache.org/job/Jena_SDB/ws/jena-sdb/pom.xml]>
[JENKINS] Archiving disabled - not archiving <https://builds.apache.org/job/Jena_SDB/ws/jena-sdb/pom.xml>
Waiting for Jenkins to finish collecting data
mavenExecutionResult exceptions not empty
message : Failed to execute goal on project jena-sdb: Could not resolve dependencies for project
org.apache.jena:jena-sdb:jar:1.3.4-SNAPSHOT: The following artifacts could not be resolved:
org.apache.jena:jena-core:jar:2.7.0, org.apache.jena:jena-core:jar:tests:2.7.0, org.apache.jena:jena-arq:jar:2.9.0,
org.apache.jena:jena-arq:jar:tests:2.9.0: Could not find artifact org.apache.jena:jena-core:jar:2.7.0
in central (http://repo1.maven.org/maven2)
cause : Could not resolve dependencies for project org.apache.jena:jena-sdb:jar:1.3.4-SNAPSHOT:
The following artifacts could not be resolved: org.apache.jena:jena-core:jar:2.7.0, org.apache.jena:jena-core:jar:tests:2.7.0,
org.apache.jena:jena-arq:jar:2.9.0, org.apache.jena:jena-arq:jar:tests:2.9.0: Could not find
artifact org.apache.jena:jena-core:jar:2.7.0 in central (http://repo1.maven.org/maven2)
Stack trace : 
org.apache.maven.lifecycle.LifecycleExecutionException: Failed to execute goal on project
jena-sdb: Could not resolve dependencies for project org.apache.jena:jena-sdb:jar:1.3.4-SNAPSHOT:
The following artifacts could not be resolved: org.apache.jena:jena-core:jar:2.7.0, org.apache.jena:jena-core:jar:tests:2.7.0,
org.apache.jena:jena-arq:jar:2.9.0, org.apache.jena:jena-arq:jar:tests:2.9.0: Could not find
artifact org.apache.jena:jena-core:jar:2.7.0 in central (http://repo1.maven.org/maven2)
	at org.apache.maven.lifecycle.internal.LifecycleDependencyResolver.getDependencies(LifecycleDependencyResolver.java:196)
	at org.apache.maven.lifecycle.internal.LifecycleDependencyResolver.resolveProjectDependencies(LifecycleDependencyResolver.java:108)
	at org.apache.maven.lifecycle.internal.MojoExecutor.ensureDependenciesAreResolved(MojoExecutor.java:258)
	at org.apache.maven.lifecycle.internal.MojoExecutor.execute(MojoExecutor.java:201)
	at org.apache.maven.lifecycle.internal.MojoExecutor.execute(MojoExecutor.java:153)
	at org.apache.maven.lifecycle.internal.MojoExecutor.execute(MojoExecutor.java:145)
	at org.apache.maven.lifecycle.internal.LifecycleModuleBuilder.buildProject(LifecycleModuleBuilder.java:84)
	at org.apache.maven.lifecycle.internal.LifecycleModuleBuilder.buildProject(LifecycleModuleBuilder.java:59)
	at org.apache.maven.lifecycle.internal.LifecycleStarter.singleThreadedBuild(LifecycleStarter.java:183)
	at org.apache.maven.lifecycle.internal.LifecycleStarter.execute(LifecycleStarter.java:161)
	at org.apache.maven.DefaultMaven.doExecute(DefaultMaven.java:319)
	at org.apache.maven.DefaultMaven.execute(DefaultMaven.java:156)
	at org.jvnet.hudson.maven3.launcher.Maven3Launcher.main(Maven3Launcher.java:79)
	at sun.reflect.NativeMethodAccessorImpl.invoke0(Native Method)
	at sun.reflect.NativeMethodAccessorImpl.invoke(NativeMethodAccessorImpl.java:39)
	at sun.reflect.DelegatingMethodAccessorImpl.invoke(DelegatingMethodAccessorImpl.java:25)
	at java.lang.reflect.Method.invoke(Method.java:597)
	at org.codehaus.plexus.classworlds.launcher.Launcher.launchStandard(Launcher.java:329)
	at org.codehaus.plexus.classworlds.launcher.Launcher.launch(Launcher.java:239)
	at org.jvnet.hudson.maven3.agent.Maven3Main.launch(Maven3Main.java:158)
	at hudson.maven.Maven3Builder.call(Maven3Builder.java:98)
	at hudson.maven.Maven3Builder.call(Maven3Builder.java:64)
	at hudson.remoting.UserRequest.perform(UserRequest.java:118)
	at hudson.remoting.UserRequest.perform(UserRequest.java:48)
	at hudson.remoting.Request$2.run(Request.java:287)
	at hudson.remoting.InterceptingExecutorService$1.call(InterceptingExecutorService.java:72)
	at java.util.concurrent.FutureTask$Sync.innerRun(FutureTask.java:303)
	at java.util.concurrent.FutureTask.run(FutureTask.java:138)
	at java.util.concurrent.ThreadPoolExecutor$Worker.runTask(ThreadPoolExecutor.java:886)
	at java.util.concurrent.ThreadPoolExecutor$Worker.run(ThreadPoolExecutor.java:908)
	at java.lang.Thread.run(Thread.java:662)
Caused by: org.apache.maven.project.DependencyResolutionException: Could not resolve dependencies
for project org.apache.jena:jena-sdb:jar:1.3.4-SNAPSHOT: The following artifacts could not
be resolved: org.apache.jena:jena-core:jar:2.7.0, org.apache.jena:jena-core:jar:tests:2.7.0,
org.apache.jena:jena-arq:jar:2.9.0, org.apache.jena:jena-arq:jar:tests:2.9.0: Could not find
artifact org.apache.jena:jena-core:jar:2.7.0 in central (http://repo1.maven.org/maven2)
	at org.apache.maven.project.DefaultProjectDependenciesResolver.resolve(DefaultProjectDependenciesResolver.java:170)
	at org.apache.maven.lifecycle.internal.LifecycleDependencyResolver.getDependencies(LifecycleDependencyResolver.java:171)
	... 30 more
Caused by: org.sonatype.aether.resolution.DependencyResolutionException: The following artifacts
could not be resolved: org.apache.jena:jena-core:jar:2.7.0, org.apache.jena:jena-core:jar:tests:2.7.0,
org.apache.jena:jena-arq:jar:2.9.0, org.apache.jena:jena-arq:jar:tests:2.9.0: Could not find
artifact org.apache.jena:jena-core:jar:2.7.0 in central (http://repo1.maven.org/maven2)
	at org.sonatype.aether.impl.internal.DefaultRepositorySystem.resolveDependencies(DefaultRepositorySystem.java:412)
	at org.apache.maven.project.DefaultProjectDependenciesResolver.resolve(DefaultProjectDependenciesResolver.java:164)
	... 31 more
Caused by: org.sonatype.aether.resolution.ArtifactResolutionException: The following artifacts
could not be resolved: org.apache.jena:jena-core:jar:2.7.0, org.apache.jena:jena-core:jar:tests:2.7.0,
org.apache.jena:jena-arq:jar:2.9.0, org.apache.jena:jena-arq:jar:tests:2.9.0: Could not find
artifact org.apache.jena:jena-core:jar:2.7.0 in central (http://repo1.maven.org/maven2)
	at org.sonatype.aether.impl.internal.DefaultArtifactResolver.resolve(DefaultArtifactResolver.java:541)
	at org.sonatype.aether.impl.internal.DefaultArtifactResolver.resolveArtifacts(DefaultArtifactResolver.java:220)
	at org.sonatype.aether.impl.internal.DefaultRepositorySystem.resolveDependencies(DefaultRepositorySystem.java:395)
	... 32 more
Caused by: org.sonatype.aether.transfer.ArtifactNotFoundException: Could not find artifact
org.apache.jena:jena-core:jar:2.7.0 in central (http://repo1.maven.org/maven2)
	at org.sonatype.aether.connector.wagon.WagonRepositoryConnector$4.wrap(WagonRepositoryConnector.java:945)
	at org.sonatype.aether.connector.wagon.WagonRepositoryConnector$4.wrap(WagonRepositoryConnector.java:940)
	at org.sonatype.aether.connector.wagon.WagonRepositoryConnector$GetTask.flush(WagonRepositoryConnector.java:695)
	at org.sonatype.aether.connector.wagon.WagonRepositoryConnector$GetTask.flush(WagonRepositoryConnector.java:689)
	at org.sonatype.aether.connector.wagon.WagonRepositoryConnector.get(WagonRepositoryConnector.java:445)
	at org.sonatype.aether.impl.internal.DefaultArtifactResolver.resolve(DefaultArtifactResolver.java:460)
	... 34 more
Sending e-mails to: commits@jena.apache.org
channel stopped

Mime
View raw message