jena-commits mailing list archives

Site index · List index
Message view « Date » · « Thread »
Top « Date » · « Thread »
From Apache Jenkins Server <jenk...@builds.apache.org>
Subject Build failed in Jenkins: Jena_ARQ » ARQ #482
Date Wed, 07 Mar 2012 00:41:43 GMT
See <https://builds.apache.org/job/Jena_ARQ/org.apache.jena$jena-arq/482/changes>

Changes:

[rvesse] First Commit - Adding a ParameterizedSparqlString class (plus tests) which is a class
to facilitate the preparation of parameterized queries/updates for scenarios where the current
initial bindings mechanism is either insufficient or not applicable (e.g. remote query preparation)
and generally to make programmatically building query strings more user friendly and less
error prone

------------------------------------------
<===[JENKINS REMOTING CAPACITY]===>channel started
   Executing Maven:  -B -f <https://builds.apache.org/job/Jena_ARQ/org.apache.jena$jena-arq/ws/pom.xml>
-Dmaven.repo.local=/home/jenkins/jenkins-slave/maven-repositories/1 clean install
[INFO] Scanning for projects...
[INFO]                                                                         
[INFO] ------------------------------------------------------------------------
[INFO] Building ARQ 2.9.1-incubating-SNAPSHOT
[INFO] ------------------------------------------------------------------------
Downloading: http://repository.apache.org/snapshots/org/apache/jena/jena-core/2.7.1-incubating-SNAPSHOT/maven-metadata.xml
Downloaded: http://repository.apache.org/snapshots/org/apache/jena/jena-core/2.7.1-incubating-SNAPSHOT/maven-metadata.xml
(2 KB at 11.3 KB/sec)
Downloading: http://repository.apache.org/snapshots/org/apache/jena/jena-iri/0.9.1-incubating-SNAPSHOT/maven-metadata.xml
Downloaded: http://repository.apache.org/snapshots/org/apache/jena/jena-iri/0.9.1-incubating-SNAPSHOT/maven-metadata.xml
(2 KB at 12.8 KB/sec)
Downloading: http://repository.apache.org/snapshots/org/apache/jena/jena-iri/0.9.1-incubating-SNAPSHOT/jena-iri-0.9.1-incubating-20120305.120450-12.pom
Downloaded: http://repository.apache.org/snapshots/org/apache/jena/jena-iri/0.9.1-incubating-SNAPSHOT/jena-iri-0.9.1-incubating-20120305.120450-12.pom
(5 KB at 52.0 KB/sec)
Downloading: http://repository.apache.org/snapshots/org/apache/jena/jena-iri/0.9.1-incubating-SNAPSHOT/jena-iri-0.9.1-incubating-20120305.120450-12.jar
Downloaded: http://repository.apache.org/snapshots/org/apache/jena/jena-iri/0.9.1-incubating-SNAPSHOT/jena-iri-0.9.1-incubating-20120305.120450-12.jar
(134 KB at 467.3 KB/sec)
[INFO] 
[INFO] --- maven-clean-plugin:2.4.1:clean (default-clean) @ jena-arq ---
log4j:WARN No appenders could be found for logger (org.apache.commons.beanutils.converters.BooleanConverter).
log4j:WARN Please initialize the log4j system properly.
[INFO] 
[INFO] --- maven-antrun-plugin:1.6:run (ant-timestamp) @ jena-arq ---
[INFO] Executing tasks

main:
     [echo] version=2.9.1-incubating-SNAPSHOT
     [echo] build.time=2012-03-07 00:41 UTC
[INFO] Executed tasks
[INFO] 
[INFO] --- maven-remote-resources-plugin:1.2.1:process (default) @ jena-arq ---
[INFO] [debug] execute contextualize
[INFO] Using 'UTF-8' encoding to copy filtered resources.

[INFO] --- maven-resources-plugin:2.5:resources (default-resources) @ jena-arq ---
[INFO] Copying 0 resource
[INFO] Copying 1 resource to com/hp/hpl/jena/sparql/
[INFO] Copying 3 resources
[INFO] 
[INFO] --- maven-compiler-plugin:2.3.2:compile (default-compile) @ jena-arq ---
[INFO] Compiling 1265 source files to <https://builds.apache.org/job/Jena_ARQ/org.apache.jena$jena-arq/ws/target/classes>
[INFO] -------------------------------------------------------------
[ERROR] COMPILATION ERROR : 
[INFO] -------------------------------------------------------------
[ERROR] <https://builds.apache.org/job/Jena_ARQ/org.apache.jena$jena-arq/ws/src/main/java/com/hp/hpl/jena/query/ParameterizedSparqlString.java>:[30,26]
package com.hp.hpl.jena.iri does not exist
[ERROR] <https://builds.apache.org/job/Jena_ARQ/org.apache.jena$jena-arq/ws/src/main/java/com/hp/hpl/jena/query/ParameterizedSparqlString.java>:[269,23]
cannot find symbol
symbol  : class IRI
location: class com.hp.hpl.jena.query.ParameterizedSparqlString
[ERROR] <https://builds.apache.org/job/Jena_ARQ/org.apache.jena$jena-arq/ws/src/main/java/com/hp/hpl/jena/query/ParameterizedSparqlString.java>:[443,32]
cannot find symbol
symbol  : class IRI
location: class com.hp.hpl.jena.query.ParameterizedSparqlString
[INFO] 3 errors 
[INFO] -------------------------------------------------------------
[JENKINS] Archiving disabled - not archiving <https://builds.apache.org/job/Jena_ARQ/org.apache.jena$jena-arq/ws/pom.xml>


Mime
View raw message