jena-commits mailing list archives

Site index · List index
Message view « Date » · « Thread »
Top « Date » · « Thread »
From Apache Jenkins Server <jenk...@builds.apache.org>
Subject Build failed in Jenkins: Jena_Core #131
Date Wed, 14 Dec 2011 21:54:34 GMT
See <https://builds.apache.org/job/Jena_Core/131/changes>

Changes:

[andy] 

------------------------------------------
Started by user andy
Started by an SCM change
Building remotely on ubuntu2
Cleaning up <https://builds.apache.org/job/Jena_Core/ws/trunk>
Deleting <https://builds.apache.org/job/Jena_Core/ws/trunk/target>
Updating http://svn.apache.org/repos/asf/incubator/jena/Jena2/jena/trunk
U         pom.xml
U         BUILD
U         .classpath
A         testing/Turtle/README_LICENSE
A         testing/Turtle/N3/README_LICENSE
A         testing/Turtle/NTriples/README_LICENSE
U         testing/Turtle/NTriples/manifest.ttl
U         testing/Turtle/RaptorTurtle/manifest-good.ttl
A         testing/Turtle/RaptorTurtle/README_LICENSE
U         testing/Turtle/RaptorTurtle/manifest-bad.ttl
U         testing/Turtle/manifest.ttl
A         testing/assemblers/README_LICENSE
U         testing/assemblers/schema.n3
U         testing/assemblers/schema2.n3
A         testing/regression/README_LICENSE
A         testing/regression/testNTripleReader/README_LICENSE
A         testing/regression/testWriterAndReader/README_LICENSE
A         testing/regression/testReaderInterface/README_LICENSE
A         testing/regression/testModelEquals/README_LICENSE
A         testing/reasoners/README_LICENSE
A         testing/reasoners/bugs/README_LICENSE
A         testing/reasoners/owl/README_LICENSE
U         testing/reasoners/transitive/manifest.rdf
A         testing/reasoners/transitive/README_LICENSE
U         testing/reasoners/rdfs/manifest-nodirect.rdf
U         testing/reasoners/rdfs/manifest-nodirect-noresource.rdf
U         testing/reasoners/rdfs/manifest-simple.rdf
U         testing/reasoners/rdfs/manifest-rdfs12.rdf
U         testing/reasoners/rdfs/manifest.rdf
A         testing/reasoners/rdfs/README_LICENSE
U         testing/reasoners/rdfs/manifest-standard.rdf
A         testing/arp/dom/README_LICENSE
A         testing/arp/i18n/README_LICENSE
U         testing/arp/Manifest.rdf
A         testing/arp/rfc2396-issue/README_LICENSE
A         testing/arp/comments/README_LICENSE
A         testing/arp/relative-namespaces/README_LICENSE
A         testing/arp/gc/README_LICENSE
A         testing/arp/xmlbase/README_LICENSE
A         testing/arp/README_LICENSE
A         testing/arp/qname-in-ID/README_LICENSE
A         testing/arp/error-msgs/README_LICENSE
A         testing/arp/syntax-errors/README_LICENSE
A         testing/arp/xmlns/README_LICENSE
A         testing/arp/rdf-nnn/README_LICENSE
A         testing/arp/unqualified/README_LICENSE
A         testing/arp/scope/README_LICENSE
A         testing/arp/parsetype/README_LICENSE
A         testing/arp/tainting/README_LICENSE
A         testing/arp/xml-literals/README_LICENSE
A         testing/cmd/README_LICENSE
U         testing/cmd/rdfcat.n3
A         testing/abbreviated/README_LICENSE
A         testing/FileManager/README_LICENSE
A         testing/modelReading/README_LICENSE
U         testing/modelReading/simple.n3
U         testing/modelReading/based.n3
A         testing/ontology/testImport1/README_LICENSE
A         testing/ontology/testImport2/README_LICENSE
A         testing/ontology/testImport3/README_LICENSE
A         testing/ontology/rdfs/README_LICENSE
A         testing/ontology/rdfs/list-syntax/README_LICENSE
A         testing/ontology/rdfs/Property/README_LICENSE
A         testing/ontology/rdfs/ClassExpression/README_LICENSE
A         testing/ontology/rdfs/Ontology/README_LICENSE
A         testing/ontology/testImport4/README_LICENSE
A         testing/ontology/testImport5/README_LICENSE
A         testing/ontology/README_LICENSE
A         testing/ontology/testImport6/README_LICENSE
A         testing/ontology/testImport7/README_LICENSE
A         testing/ontology/owl/README_LICENSE
A         testing/ontology/owl/list-syntax/README_LICENSE
A         testing/ontology/owl/Axioms/README_LICENSE
A         testing/ontology/owl/Wine/README_LICENSE
A         testing/ontology/owl/Property/README_LICENSE
A         testing/ontology/owl/ClassExpression/README_LICENSE
A         testing/ontology/owl/Ontology/README_LICENSE
A         testing/ontology/testImport8/README_LICENSE
A         testing/ontology/testImport9/README_LICENSE
A         testing/ontology/dig/README_LICENSE
A         testing/ontology/dig/owl/README_LICENSE
A         testing/ontology/dig/owl/basicq/README_LICENSE
A         testing/ontology/dig/owl/cl/README_LICENSE
A         testing/ontology/daml/README_LICENSE
A         testing/ontology/daml/list-syntax/README_LICENSE
A         testing/ontology/daml/Axioms/README_LICENSE
A         testing/ontology/daml/Property/README_LICENSE
A         testing/ontology/daml/daml_oil_2001_03/README_LICENSE
A         testing/ontology/daml/ClassExpression/README_LICENSE
A         testing/ontology/daml/Ontology/README_LICENSE
U         testing/wg/Manifest-extra.rdf
U         testing/wg/Manifest-wrong.rdf
A         testing/modelspecs/README_LICENSE
U         testing/modelspecs/schema.n3
U         testing/modelspecs/schema2.n3
A         testing/xsd/README_LICENSE
At revision 1214495
Parsing POMs
ERROR: Failed to parse POMs
hudson.util.IOException2: remote file operation failed: <https://builds.apache.org/job/Jena_Core/ws/trunk>
at hudson.remoting.Channel@ed577f4:ubuntu2
	at hudson.FilePath.act(FilePath.java:754)
	at hudson.FilePath.act(FilePath.java:740)
	at hudson.maven.MavenModuleSetBuild$RunnerImpl.parsePoms(MavenModuleSetBuild.java:869)
	at hudson.maven.MavenModuleSetBuild$RunnerImpl.doRun(MavenModuleSetBuild.java:639)
	at hudson.model.AbstractBuild$AbstractRunner.run(AbstractBuild.java:459)
	at hudson.model.Run.run(Run.java:1376)
	at hudson.maven.MavenModuleSetBuild.run(MavenModuleSetBuild.java:474)
	at hudson.model.ResourceController.execute(ResourceController.java:88)
	at hudson.model.Executor.run(Executor.java:230)
Caused by: hudson.remoting.ProxyException: hudson.maven.MavenModuleSetBuild$MavenExecutionException:
org.apache.maven.project.ProjectBuildingException: Some problems were encountered while processing
the POMs:
[FATAL] Non-resolvable parent POM: Could not find artifact org.apache.jena:jena-top:pom:1-incubating-SNAPSHOT
and 'parent.relativePath' points at wrong local POM @ line 28, column 11

	at hudson.maven.MavenModuleSetBuild$PomParser.invoke(MavenModuleSetBuild.java:1403)
	at hudson.maven.MavenModuleSetBuild$PomParser.invoke(MavenModuleSetBuild.java:1182)
	at hudson.FilePath$FileCallableWrapper.call(FilePath.java:1995)
	at hudson.remoting.UserRequest.perform(UserRequest.java:118)
	at hudson.remoting.UserRequest.perform(UserRequest.java:48)
	at hudson.remoting.Request$2.run(Request.java:287)
	at java.util.concurrent.Executors$RunnableAdapter.call(Executors.java:471)
	at java.util.concurrent.FutureTask$Sync.innerRun(FutureTask.java:334)
	at java.util.concurrent.FutureTask.run(FutureTask.java:166)
	at java.util.concurrent.ThreadPoolExecutor.runWorker(ThreadPoolExecutor.java:1110)
	at java.util.concurrent.ThreadPoolExecutor$Worker.run(ThreadPoolExecutor.java:603)
	at java.lang.Thread.run(Thread.java:636)
Caused by: hudson.remoting.ProxyException: org.apache.maven.project.ProjectBuildingException:
Some problems were encountered while processing the POMs:
[FATAL] Non-resolvable parent POM: Could not find artifact org.apache.jena:jena-top:pom:1-incubating-SNAPSHOT
and 'parent.relativePath' points at wrong local POM @ line 28, column 11

	at org.apache.maven.project.DefaultProjectBuilder.build(DefaultProjectBuilder.java:339)
	at hudson.maven.MavenEmbedder.buildProjects(MavenEmbedder.java:360)
	at hudson.maven.MavenEmbedder.readProjects(MavenEmbedder.java:330)
	at hudson.maven.MavenModuleSetBuild$PomParser.invoke(MavenModuleSetBuild.java:1353)
	... 11 more


Mime
View raw message