jena-commits mailing list archives

Site index · List index
Message view « Date » · « Thread »
Top « Date » · « Thread »
From Apache Jenkins Server <jenk...@builds.apache.org>
Subject Build failed in Jenkins: Jena_Fuseki » Fuseki #358
Date Thu, 15 Dec 2011 04:29:09 GMT
See <https://builds.apache.org/job/Jena_Fuseki/org.apache.jena$jena-fuseki/358/>

------------------------------------------
<===[JENKINS REMOTING CAPACITY]===>channel started
   Executing Maven:  -B -f <https://builds.apache.org/job/Jena_Fuseki/org.apache.jena$jena-fuseki/ws/pom.xml>
clean install
[INFO] Scanning for projects...
[INFO]                                                                         
[INFO] ------------------------------------------------------------------------
[INFO] Building Fuseki 0.2.1-incubating-SNAPSHOT
[INFO] ------------------------------------------------------------------------
Downloading: http://repository.apache.org/content/repositories/orgapachejena-334/org/apache/jena/jena-arq/2.9.1-incubating-SNAPSHOT/maven-metadata.xml
Downloading: http://repository.apache.org/snapshots/org/apache/jena/jena-arq/2.9.1-incubating-SNAPSHOT/maven-metadata.xml
[WARNING] Checksum validation failed, expected <!DOCTYPE but is b57bc721c3d5d1c5e08379c8c884d445520ad723
for http://repository.apache.org/content/repositories/orgapachejena-334/org/apache/jena/jena-arq/2.9.1-incubating-SNAPSHOT/maven-metadata.xml
[WARNING] Checksum validation failed, expected <!DOCTYPE but is b57bc721c3d5d1c5e08379c8c884d445520ad723
for http://repository.apache.org/content/repositories/orgapachejena-334/org/apache/jena/jena-arq/2.9.1-incubating-SNAPSHOT/maven-metadata.xml
Downloaded: http://repository.apache.org/content/repositories/orgapachejena-334/org/apache/jena/jena-arq/2.9.1-incubating-SNAPSHOT/maven-metadata.xml
(409 B at 2.2 KB/sec)
Downloaded: http://repository.apache.org/snapshots/org/apache/jena/jena-arq/2.9.1-incubating-SNAPSHOT/maven-metadata.xml
(2 KB at 4.4 KB/sec)
[WARNING] The metadata /home/jenkins/.m2/repository/org/apache/jena/jena-arq/2.9.1-incubating-SNAPSHOT/maven-metadata-apache.staging.xml
is invalid: end tag name </body> must match start tag name <hr> from line 7 (position:
TEXT seen ...</address>\n</body>... @9:8) 
Downloading: http://repository.apache.org/content/repositories/orgapachejena-334/org/apache/jena/jena-arq/2.9.1-incubating-SNAPSHOT/jena-arq-2.9.1-incubating-20111215.030552-1.pom
[WARNING] Checksum validation failed, expected <!DOCTYPE but is e4ed078f270e5d9b67a53c3e3907d1878ef016ac
for http://repository.apache.org/content/repositories/orgapachejena-334/org/apache/jena/jena-arq/2.9.1-incubating-SNAPSHOT/jena-arq-2.9.1-incubating-20111215.030552-1.pom
[WARNING] Checksum validation failed, expected <!DOCTYPE but is e4ed078f270e5d9b67a53c3e3907d1878ef016ac
for http://repository.apache.org/content/repositories/orgapachejena-334/org/apache/jena/jena-arq/2.9.1-incubating-SNAPSHOT/jena-arq-2.9.1-incubating-20111215.030552-1.pom
Downloaded: http://repository.apache.org/content/repositories/orgapachejena-334/org/apache/jena/jena-arq/2.9.1-incubating-SNAPSHOT/jena-arq-2.9.1-incubating-20111215.030552-1.pom
(438 B at 3.4 KB/sec)
[WARNING] The POM for org.apache.jena:jena-arq:jar:2.9.1-incubating-20111215.030552-1 is invalid,
transitive dependencies (if any) will not be available, enable debug logging for more details
[WARNING] The metadata /home/jenkins/.m2/repository/org/apache/jena/jena-arq/2.9.1-incubating-SNAPSHOT/maven-metadata-apache.staging.xml
is invalid: end tag name </body> must match start tag name <hr> from line 7 (position:
TEXT seen ...</address>\n</body>... @9:8) 
[WARNING] The POM for org.apache.jena:jena-arq:jar:tests:2.9.1-incubating-20111215.030552-1
is invalid, transitive dependencies (if any) will not be available, enable debug logging for
more details
Downloading: http://repository.apache.org/content/repositories/orgapachejena-334/org/apache/jena/jena-top/1-incubating-SNAPSHOT/maven-metadata.xml
[WARNING] Checksum validation failed, expected <!DOCTYPE but is d605d72a3de04b340d9fa17746286a61b6feaba1
for http://repository.apache.org/content/repositories/orgapachejena-334/org/apache/jena/jena-top/1-incubating-SNAPSHOT/maven-metadata.xml
[WARNING] Checksum validation failed, expected <!DOCTYPE but is d605d72a3de04b340d9fa17746286a61b6feaba1
for http://repository.apache.org/content/repositories/orgapachejena-334/org/apache/jena/jena-top/1-incubating-SNAPSHOT/maven-metadata.xml
Downloaded: http://repository.apache.org/content/repositories/orgapachejena-334/org/apache/jena/jena-top/1-incubating-SNAPSHOT/maven-metadata.xml
(405 B at 3.2 KB/sec)
[WARNING] The metadata /home/jenkins/.m2/repository/org/apache/jena/jena-top/1-incubating-SNAPSHOT/maven-metadata-apache.staging.xml
is invalid: end tag name </body> must match start tag name <hr> from line 7 (position:
TEXT seen ...</address>\n</body>... @9:8) 
Downloading: http://repository.apache.org/content/repositories/orgapachejena-334/org/apache/jena/jena-tdb/0.9.1-incubating-SNAPSHOT/maven-metadata.xml
Downloading: http://repository.apache.org/snapshots/org/apache/jena/jena-tdb/0.9.1-incubating-SNAPSHOT/maven-metadata.xml
[WARNING] Checksum validation failed, expected <!DOCTYPE but is bd11dcf7d7ee82a3a464beb86bb6087980e5ac1d
for http://repository.apache.org/content/repositories/orgapachejena-334/org/apache/jena/jena-tdb/0.9.1-incubating-SNAPSHOT/maven-metadata.xml
[WARNING] Checksum validation failed, expected <!DOCTYPE but is bd11dcf7d7ee82a3a464beb86bb6087980e5ac1d
for http://repository.apache.org/content/repositories/orgapachejena-334/org/apache/jena/jena-tdb/0.9.1-incubating-SNAPSHOT/maven-metadata.xml
Downloaded: http://repository.apache.org/content/repositories/orgapachejena-334/org/apache/jena/jena-tdb/0.9.1-incubating-SNAPSHOT/maven-metadata.xml
(409 B at 3.0 KB/sec)
[WARNING] The metadata /home/jenkins/.m2/repository/org/apache/jena/jena-tdb/0.9.1-incubating-SNAPSHOT/maven-metadata-apache.staging.xml
is invalid: end tag name </body> must match start tag name <hr> from line 7 (position:
TEXT seen ...</address>\n</body>... @9:8) 
[WARNING] The metadata /home/jenkins/.m2/repository/org/apache/jena/jena-tdb/0.9.1-incubating-SNAPSHOT/maven-metadata-apache.staging.xml
is invalid: end tag name </body> must match start tag name <hr> from line 7 (position:
TEXT seen ...</address>\n</body>... @9:8) 
Downloading: http://repository.apache.org/content/repositories/orgapachejena-334/org/apache/jena/jena-tdb/0.9.1-incubating-SNAPSHOT/jena-tdb-0.9.1-incubating-SNAPSHOT.pom
[WARNING] Checksum validation failed, expected <!DOCTYPE but is f772675cb43b4a5e840c9875dd63087151f6c707
for http://repository.apache.org/content/repositories/orgapachejena-334/org/apache/jena/jena-tdb/0.9.1-incubating-SNAPSHOT/jena-tdb-0.9.1-incubating-SNAPSHOT.pom
[WARNING] Checksum validation failed, expected <!DOCTYPE but is f772675cb43b4a5e840c9875dd63087151f6c707
for http://repository.apache.org/content/repositories/orgapachejena-334/org/apache/jena/jena-tdb/0.9.1-incubating-SNAPSHOT/jena-tdb-0.9.1-incubating-SNAPSHOT.pom
Downloaded: http://repository.apache.org/content/repositories/orgapachejena-334/org/apache/jena/jena-tdb/0.9.1-incubating-SNAPSHOT/jena-tdb-0.9.1-incubating-SNAPSHOT.pom
(429 B at 3.4 KB/sec)
[WARNING] The POM for org.apache.jena:jena-tdb:jar:0.9.1-incubating-SNAPSHOT is invalid, transitive
dependencies (if any) will not be available, enable debug logging for more details
Downloading: http://repository.apache.org/snapshots/org/apache/jena/jena-arq/2.9.1-incubating-SNAPSHOT/jena-arq-2.9.1-incubating-20111215.030552-1.jar
Downloading: http://repository.apache.org/snapshots/org/apache/jena/jena-arq/2.9.1-incubating-SNAPSHOT/jena-arq-2.9.1-incubating-20111215.030552-1-tests.jar
Downloaded: http://repository.apache.org/snapshots/org/apache/jena/jena-arq/2.9.1-incubating-SNAPSHOT/jena-arq-2.9.1-incubating-20111215.030552-1-tests.jar
(381 KB at 737.8 KB/sec)
Downloaded: http://repository.apache.org/snapshots/org/apache/jena/jena-arq/2.9.1-incubating-SNAPSHOT/jena-arq-2.9.1-incubating-20111215.030552-1.jar
(2207 KB at 958.1 KB/sec)
Downloading: http://repository.apache.org/content/repositories/orgapachejena-334/org/apache/jena/jena-tdb/0.9.1-incubating-SNAPSHOT/jena-tdb-0.9.1-incubating-SNAPSHOT.jar
[WARNING] Checksum validation failed, expected <!DOCTYPE but is cb3b2fae053c088ff5f7f253595547ef1f08e46d
for http://repository.apache.org/content/repositories/orgapachejena-334/org/apache/jena/jena-tdb/0.9.1-incubating-SNAPSHOT/jena-tdb-0.9.1-incubating-SNAPSHOT.jar
[WARNING] Checksum validation failed, expected <!DOCTYPE but is cb3b2fae053c088ff5f7f253595547ef1f08e46d
for http://repository.apache.org/content/repositories/orgapachejena-334/org/apache/jena/jena-tdb/0.9.1-incubating-SNAPSHOT/jena-tdb-0.9.1-incubating-SNAPSHOT.jar
Downloaded: http://repository.apache.org/content/repositories/orgapachejena-334/org/apache/jena/jena-tdb/0.9.1-incubating-SNAPSHOT/jena-tdb-0.9.1-incubating-SNAPSHOT.jar
(429 B at 3.4 KB/sec)
[INFO] 
[INFO] --- maven-clean-plugin:2.4.1:clean (default-clean) @ jena-fuseki ---
[INFO] 
[INFO] --- maven-remote-resources-plugin:1.2.1:process (default) @ jena-fuseki ---
[WARNING] Invalid POM for org.apache.jena:jena-arq:jar:2.9.1-incubating-SNAPSHOT, transitive
dependencies (if any) will not be available, enable debug logging for more details
[WARNING] Invalid POM for org.apache.jena:jena-arq:jar:tests:2.9.1-incubating-SNAPSHOT, transitive
dependencies (if any) will not be available, enable debug logging for more details
[WARNING] Invalid POM for org.apache.jena:jena-tdb:jar:0.9.1-incubating-SNAPSHOT, transitive
dependencies (if any) will not be available, enable debug logging for more details
[WARNING] Invalid project model for artifact [jena-tdb:org.apache.jena:0.9.1-incubating-SNAPSHOT].
It will be ignored by the remote resources Mojo.
[WARNING] The metadata /home/jenkins/.m2/repository/org/apache/jena/jena-arq/2.9.1-incubating-SNAPSHOT/maven-metadata-apache.staging.xml
is invalid: end tag name </body> must match start tag name <hr> from line 7 (position:
TEXT seen ...</address>\n</body>... @9:8) 
Downloading: http://repository.apache.org/snapshots/org/apache/jena/jena-arq/2.9.1-incubating-SNAPSHOT/jena-arq-2.9.1-incubating-20111215.030552-1.pom
Downloaded: http://repository.apache.org/snapshots/org/apache/jena/jena-arq/2.9.1-incubating-SNAPSHOT/jena-arq-2.9.1-incubating-20111215.030552-1.pom
(0 B at 0.0 KB/sec)
[WARNING] Invalid project model for artifact [jena-arq:org.apache.jena:2.9.1-incubating-SNAPSHOT].
It will be ignored by the remote resources Mojo.
[INFO] 
[INFO] --- maven-antrun-plugin:1.6:run (ant-generate-resources) @ jena-fuseki ---
[INFO] Executing tasks

main:
     [echo] Version = 0.2.1-incubating-SNAPSHOT
     [echo] build.time=2011-12-15 04:29 +0000
[INFO] Executed tasks
[INFO] 
[INFO] --- maven-resources-plugin:2.5:resources (default-resources) @ jena-fuseki ---[debug]
execute contextualize
[INFO] Using 'UTF-8' encoding to copy filtered resources.

[INFO] Copying 1 resource
[INFO] Copying 3 resources
[INFO] 
[INFO] --- maven-compiler-plugin:2.3.2:compile (default-compile) @ jena-fuseki ---
[INFO] Compiling 69 source files to <https://builds.apache.org/job/Jena_Fuseki/org.apache.jena$jena-fuseki/ws/target/classes>
[INFO] -------------------------------------------------------------
[ERROR] COMPILATION ERROR : 
[INFO] -------------------------------------------------------------
[ERROR] error: error reading /home/jenkins/.m2/repository/org/apache/jena/jena-tdb/0.9.1-incubating-SNAPSHOT/jena-tdb-0.9.1-incubating-SNAPSHOT.jar;
error in opening zip file
[INFO] 1 error
[INFO] -------------------------------------------------------------
[JENKINS] Archiving disabled - not archiving <https://builds.apache.org/job/Jena_Fuseki/org.apache.jena$jena-fuseki/ws/pom.xml>


Mime
View raw message