jena-commits mailing list archives

Site index · List index
Message view « Date » · « Thread »
Top « Date » · « Thread »
From Apache Jenkins Server <jenk...@builds.apache.org>
Subject Build failed in Jenkins: Jena_ARQ_Snapshot #66
Date Wed, 14 Dec 2011 12:31:22 GMT
See <https://builds.apache.org/job/Jena_ARQ_Snapshot/66/changes>

Changes:

[andy] [maven-release-plugin] prepare for next development iteration

[andy] [maven-release-plugin] prepare release jena-arq-2.9.0-incubating-RC-1

[andy] Prepare POM for 2.9.0 release

[andy] Prepare POM for 2.9.0 release

------------------------------------------
[...truncated 4341 lines...]
AU        testing/DAWG-Final/syntax-sparql3/syn-blabel-cross-optional-bad.rq
AU        testing/DAWG-Final/syntax-sparql3/syn-01.rq
AU        testing/DAWG-Final/syntax-sparql3/manifest.ttl
AU        testing/DAWG-Final/syntax-sparql3/syn-blabel-cross-union-bad.rq
AU        testing/DAWG-Final/syntax-sparql3/syn-03.rq
AU        testing/DAWG-Final/syntax-sparql3/syn-bad-empty-optional-02.rq
AU        testing/DAWG-Final/syntax-sparql3/syn-05.rq
AU        testing/DAWG-Final/syntax-sparql3/syn-07.rq
AU        testing/DAWG-Final/syntax-sparql3/syn-bad-lone-list.rq
A         testing/DAWG-Final/syntax-sparql3/LICENSE
AU        testing/DAWG-Final/syntax-sparql3/syn-blabel-cross-filter.rq
AU        testing/DAWG-Final/syntax-sparql3/syn-bad-bnodes-missing-pvalues-02.rq
AU        testing/DAWG-Final/syntax-sparql3/syn-bad-01.rq
AU        testing/DAWG-Final/syntax-sparql3/syn-bad-lone-node.rq
AU        testing/DAWG-Final/syntax-sparql3/syn-bad-11.rq
AU        testing/DAWG-Final/syntax-sparql3/syn-bad-21.rq
AU        testing/DAWG-Final/syntax-sparql3/syn-bad-03.rq
AU        testing/DAWG-Final/syntax-sparql3/syn-bad-filter-missing-parens.rq
AU        testing/DAWG-Final/syntax-sparql3/syn-bad-13.rq
AU        testing/DAWG-Final/syntax-sparql3/syn-bad-31.rq
AU        testing/DAWG-Final/syntax-sparql3/syn-bad-05.rq
AU        testing/DAWG-Final/syntax-sparql3/syn-bad-23.rq
AU        testing/DAWG-Final/syntax-sparql3/syn-bad-15.rq
AU        testing/DAWG-Final/syntax-sparql3/syn-bad-07.rq
AU        testing/DAWG-Final/syntax-sparql3/syn-bad-25.rq
AU        testing/DAWG-Final/syntax-sparql3/syn-bad-17.rq
AU        testing/DAWG-Final/syntax-sparql3/syn-bad-09.rq
AU        testing/DAWG-Final/syntax-sparql3/syn-bad-27.rq
AU        testing/DAWG-Final/syntax-sparql3/syn-bad-19.rq
AU        testing/DAWG-Final/syntax-sparql3/syn-bad-29.rq
AU        testing/DAWG-Final/syntax-sparql3/syn-02.rq
AU        testing/DAWG-Final/syntax-sparql3/syn-04.rq
AU        testing/DAWG-Final/syntax-sparql3/syn-bad-empty-optional-01.rq
AU        testing/DAWG-Final/syntax-sparql3/syn-06.rq
A         testing/DAWG-Final/syntax-sparql4
AU        testing/DAWG-Final/syntax-sparql4/syn-bad-UNION-breaks-BGP.rq
AU        testing/DAWG-Final/syntax-sparql4/syn-09.rq
A         testing/DAWG-Final/syntax-sparql4/LICENSE
AU        testing/DAWG-Final/syntax-sparql4/syn-bad-34.rq
AU        testing/DAWG-Final/syntax-sparql4/syn-bad-35.rq
AU        testing/DAWG-Final/syntax-sparql4/syn-bad-36.rq
AU        testing/DAWG-Final/syntax-sparql4/syn-bad-37.rq
AU        testing/DAWG-Final/syntax-sparql4/syn-leading-digits-in-prefixed-names.rq
AU        testing/DAWG-Final/syntax-sparql4/syn-bad-38.rq
AU        testing/DAWG-Final/syntax-sparql4/manifest.ttl
AU        testing/DAWG-Final/syntax-sparql4/syn-10.rq
AU        testing/DAWG-Final/syntax-sparql4/syn-bad-GRAPH-breaks-BGP.rq
AU        testing/DAWG-Final/syntax-sparql4/syn-11.rq
AU        testing/DAWG-Final/syntax-sparql4/syn-bad-OPT-breaks-BGP.rq
A         testing/DAWG-Final/reduced
A         testing/DAWG-Final/reduced/LICENSE
AU        testing/DAWG-Final/reduced/reduced-str.ttl
AU        testing/DAWG-Final/reduced/reduced-1.srx
AU        testing/DAWG-Final/reduced/reduced-star.ttl
AU        testing/DAWG-Final/reduced/reduced-2.srx
AU        testing/DAWG-Final/reduced/manifest.ttl
AU        testing/DAWG-Final/reduced/reduced-1.rq
AU        testing/DAWG-Final/reduced/reduced-2.rq
A         testing/DAWG-Final/syntax-sparql5
AU        testing/DAWG-Final/syntax-sparql5/syntax-reduced-02.rq
A         testing/DAWG-Final/syntax-sparql5/LICENSE
AU        testing/DAWG-Final/syntax-sparql5/manifest.ttl
AU        testing/DAWG-Final/syntax-sparql5/syntax-reduced-01.rq
A         testing/DAWG-Final/expr-ops
AU        testing/DAWG-Final/expr-ops/query-mul-1.rq
AU        testing/DAWG-Final/expr-ops/query-unminus-1.rq
AU        testing/DAWG-Final/expr-ops/result-ge-1.srx
AU        testing/DAWG-Final/expr-ops/result-minus-1.srx
A         testing/DAWG-Final/expr-ops/LICENSE
AU        testing/DAWG-Final/expr-ops/query-le-1.rq
AU        testing/DAWG-Final/expr-ops/result-mul-1.srx
AU        testing/DAWG-Final/expr-ops/result-unminus-1.srx
AU        testing/DAWG-Final/expr-ops/result-le-1.srx
AU        testing/DAWG-Final/expr-ops/query-plus-1.rq
AU        testing/DAWG-Final/expr-ops/manifest.ttl
AU        testing/DAWG-Final/expr-ops/query-unplus-1.rq
AU        testing/DAWG-Final/expr-ops/result-plus-1.srx
AU        testing/DAWG-Final/expr-ops/result-unplus-1.srx
AU        testing/DAWG-Final/expr-ops/data.ttl
AU        testing/DAWG-Final/expr-ops/query-minus-1.rq
AU        testing/DAWG-Final/expr-ops/query-ge-1.rq
A         testing/ResultSet
AU        testing/ResultSet/output2.srj
A         testing/ResultSet/output.srx
AU        testing/ResultSet/output.srj
A         testing/ResultSet/output2.srx
A         testing/README.txt
A         testing/RIOT
A         testing/RIOT/Files
AU        testing/RIOT/Files/data.ttl
A         testing/RIOT/RDF-JSON
A         testing/RIOT/RDF-JSON/rdf-json-00.nt
A         testing/RIOT/RDF-JSON/rdf-json-bad-02.rj
A         testing/RIOT/RDF-JSON/rdf-json-90.rj
A         testing/RIOT/RDF-JSON/rdf-json-91.rdf
A         testing/RIOT/RDF-JSON/rdf-json-91.rj
AU        testing/RIOT/RDF-JSON/manifest.ttl
A         testing/RIOT/RDF-JSON/rdf-json-90.nt
A         testing/RIOT/RDF-JSON/rdf-json-00.rj
AU        testing/RIOT/RDF-JSON/manifest-bad.ttl
A         testing/RIOT/RDF-JSON/rdf-json-bad-01.rj
A         testing/RIOT/TriG
A         testing/RIOT/TriG/trig-test-00.trig
A         testing/RIOT/TriG/trig-test-01.trig
A         testing/RIOT/TriG/trig-empty.trig
A         testing/RIOT/TriG/trig-test-02.trig
AU        testing/RIOT/TriG/manifest.ttl
A         testing/RIOT/TriG/trig-bad-00.trig
A         testing/RIOT/TriG/trig-bad-01.trig
AU        testing/RIOT/TriG/manifest-bad.ttl
A         testing/RIOT/TriG/trig-test-00.nq
A         testing/RIOT/TriG/trig-test-01.nq
A         testing/RIOT/TriG/trig-test-02.nq
A         testing/RIOT/N-Quads
A         testing/RIOT/TurtleStd
A         testing/RIOT/TurtleStd/rdf-schema.out
AU        testing/RIOT/TurtleStd/rdfs-namespace.ttl
AU        testing/RIOT/TurtleStd/rdfq-results.ttl
AU        testing/RIOT/TurtleStd/test-10.ttl
AU        testing/RIOT/TurtleStd/test-11.ttl
AU        testing/RIOT/TurtleStd/test-12.ttl
AU        testing/RIOT/TurtleStd/test-13.ttl
AU        testing/RIOT/TurtleStd/test-14.ttl
AU        testing/RIOT/TurtleStd/test-15.ttl
A         testing/RIOT/TurtleStd/test-20.out
A         testing/RIOT/TurtleStd/test-21.out
AU        testing/RIOT/TurtleStd/test-16.ttl
A         testing/RIOT/TurtleStd/test-22.out
AU        testing/RIOT/TurtleStd/bad-10.ttl
AU        testing/RIOT/TurtleStd/test-17.ttl
AU        testing/RIOT/TurtleStd/test-18.ttl
AU        testing/RIOT/TurtleStd/bad-11.ttl
A         testing/RIOT/TurtleStd/test-23.out
AU        testing/RIOT/TurtleStd/test-19.ttl
AU        testing/RIOT/TurtleStd/bad-12.ttl
A         testing/RIOT/TurtleStd/test-24.out
AU        testing/RIOT/TurtleStd/bad-13.ttl
A         testing/RIOT/TurtleStd/test-25.out
AU        testing/RIOT/TurtleStd/bad-14.ttl
A         testing/RIOT/TurtleStd/test-26.out
AU        testing/RIOT/TurtleStd/rdf-schema.ttl
A         testing/RIOT/TurtleStd/test-27.out
A         testing/RIOT/TurtleStd/test-28.out
A         testing/RIOT/TurtleStd/test-29.out
AU        testing/RIOT/TurtleStd/manifest-bad.ttl
AU        testing/RIOT/TurtleStd/test-20.ttl
AU        testing/RIOT/TurtleStd/test-21.ttl
AU        testing/RIOT/TurtleStd/test-22.ttl
AU        testing/RIOT/TurtleStd/test-23.ttl
AU        testing/RIOT/TurtleStd/test-24.ttl
A         testing/RIOT/TurtleStd/test-30.out
AU        testing/RIOT/TurtleStd/test-25.ttl
AU        testing/RIOT/TurtleStd/test-26.ttl
AU        testing/RIOT/TurtleStd/test-27.ttl
AU        testing/RIOT/TurtleStd/test-28.ttl
AU        testing/RIOT/TurtleStd/test-29.ttl
AU        testing/RIOT/TurtleStd/test-30.ttl
A         testing/RIOT/TurtleStd/test-00.out
A         testing/RIOT/TurtleStd/test-01.out
A         testing/RIOT/TurtleStd/test-02.out
A         testing/RIOT/TurtleStd/test-03.out
A         testing/RIOT/TurtleStd/test-04.out
A         testing/RIOT/TurtleStd/test-05.out
AU        testing/RIOT/TurtleStd/manifest.ttl
A         testing/RIOT/TurtleStd/test-06.out
A         testing/RIOT/TurtleStd/test-07.out
A         testing/RIOT/TurtleStd/test-08.out
A         testing/RIOT/TurtleStd/test-09.out
AU        testing/RIOT/TurtleStd/test-00.ttl
A         testing/RIOT/TurtleStd/rdfs-namespace.out
AU        testing/RIOT/TurtleStd/test-01.ttl
AU        testing/RIOT/TurtleStd/test-02.ttl
AU        testing/RIOT/TurtleStd/test-03.ttl
A         testing/RIOT/TurtleStd/rdfq-results.out
AU        testing/RIOT/TurtleStd/test-04.ttl
AU        testing/RIOT/TurtleStd/test-05.ttl
A         testing/RIOT/TurtleStd/test-10.out
AU        testing/RIOT/TurtleStd/test-06.ttl
A         testing/RIOT/TurtleStd/test-11.out
A         testing/RIOT/TurtleStd/test-12.out
AU        testing/RIOT/TurtleStd/test-07.ttl
AU        testing/RIOT/TurtleStd/bad-00.ttl
A         testing/RIOT/TurtleStd/test-13.out
AU        testing/RIOT/TurtleStd/test-08.ttl
AU        testing/RIOT/TurtleStd/bad-01.ttl
A         testing/RIOT/TurtleStd/test-14.out
AU        testing/RIOT/TurtleStd/test-09.ttl
AU        testing/RIOT/TurtleStd/bad-02.ttl
A         testing/RIOT/TurtleStd/test-15.out
AU        testing/RIOT/TurtleStd/bad-03.ttl
A         testing/RIOT/TurtleStd/test-16.out
AU        testing/RIOT/TurtleStd/bad-04.ttl
A         testing/RIOT/TurtleStd/test-17.out
AU        testing/RIOT/TurtleStd/bad-05.ttl
A         testing/RIOT/TurtleStd/test-18.out
AU        testing/RIOT/TurtleStd/bad-06.ttl
A         testing/RIOT/TurtleStd/test-19.out
AU        testing/RIOT/TurtleStd/bad-07.ttl
AU        testing/RIOT/TurtleStd/bad-08.ttl
AU        testing/RIOT/TurtleStd/test-28-out.ttl
AU        testing/RIOT/TurtleStd/bad-09.ttl
A         testing/RIOT/N-Triples
A         .settings
A         .settings/org.eclipse.jdt.core.prefs
AU        .settings/org.eclipse.core.runtime.prefs
A         .settings/org.eclipse.jdt.ui.prefs
AU        .settings/org.eclipse.core.resources.prefs
AU        .settings/org.maven.ide.eclipse.prefs
AU        assembly.xml
 U        .
At revision 1214211
Parsing POMs
Failed to transfer File: http://repo1.maven.org/maven2/org/apache/jena/jena-top/0-incubating/jena-top-0-incubating.pom
does not exist
ERROR: Failed to parse POMs
hudson.util.IOException2: remote file operation failed: <https://builds.apache.org/job/Jena_ARQ_Snapshot/ws/trunk>
at hudson.remoting.Channel@8fa1d96:ubuntu4
	at hudson.FilePath.act(FilePath.java:754)
	at hudson.FilePath.act(FilePath.java:740)
	at hudson.maven.MavenModuleSetBuild$RunnerImpl.parsePoms(MavenModuleSetBuild.java:869)
	at hudson.maven.MavenModuleSetBuild$RunnerImpl.doRun(MavenModuleSetBuild.java:639)
	at hudson.model.AbstractBuild$AbstractRunner.run(AbstractBuild.java:459)
	at hudson.model.Run.run(Run.java:1376)
	at hudson.maven.MavenModuleSetBuild.run(MavenModuleSetBuild.java:474)
	at hudson.model.ResourceController.execute(ResourceController.java:88)
	at hudson.model.Executor.run(Executor.java:230)
Caused by: hudson.remoting.ProxyException: hudson.maven.MavenModuleSetBuild$MavenExecutionException:
org.apache.maven.project.ProjectBuildingException: Some problems were encountered while processing
the POMs:
[WARNING] 'build.plugins.plugin.(groupId:artifactId)' must be unique but found duplicate declaration
of plugin org.apache.maven.plugins:maven-resources-plugin @ line 197, column 15
[FATAL] Non-resolvable parent POM: Could not find artifact org.apache.jena:jena-top:pom:0-incubating
in central (http://repo1.maven.org/maven2) and 'parent.relativePath' points at wrong local
POM @ line 28, column 11

	at hudson.maven.MavenModuleSetBuild$PomParser.invoke(MavenModuleSetBuild.java:1403)
	at hudson.maven.MavenModuleSetBuild$PomParser.invoke(MavenModuleSetBuild.java:1182)
	at hudson.FilePath$FileCallableWrapper.call(FilePath.java:1995)
	at hudson.remoting.UserRequest.perform(UserRequest.java:118)
	at hudson.remoting.UserRequest.perform(UserRequest.java:48)
	at hudson.remoting.Request$2.run(Request.java:287)
	at java.util.concurrent.Executors$RunnableAdapter.call(Executors.java:471)
	at java.util.concurrent.FutureTask$Sync.innerRun(FutureTask.java:334)
	at java.util.concurrent.FutureTask.run(FutureTask.java:166)
	at java.util.concurrent.ThreadPoolExecutor.runWorker(ThreadPoolExecutor.java:1110)
	at java.util.concurrent.ThreadPoolExecutor$Worker.run(ThreadPoolExecutor.java:603)
	at java.lang.Thread.run(Thread.java:636)
Caused by: hudson.remoting.ProxyException: org.apache.maven.project.ProjectBuildingException:
Some problems were encountered while processing the POMs:
[WARNING] 'build.plugins.plugin.(groupId:artifactId)' must be unique but found duplicate declaration
of plugin org.apache.maven.plugins:maven-resources-plugin @ line 197, column 15
[FATAL] Non-resolvable parent POM: Could not find artifact org.apache.jena:jena-top:pom:0-incubating
in central (http://repo1.maven.org/maven2) and 'parent.relativePath' points at wrong local
POM @ line 28, column 11

	at org.apache.maven.project.DefaultProjectBuilder.build(DefaultProjectBuilder.java:339)
	at hudson.maven.MavenEmbedder.buildProjects(MavenEmbedder.java:360)
	at hudson.maven.MavenEmbedder.readProjects(MavenEmbedder.java:330)
	at hudson.maven.MavenModuleSetBuild$PomParser.invoke(MavenModuleSetBuild.java:1353)
	... 11 more


Mime
View raw message