jena-commits mailing list archives

Site index · List index
Message view « Date » · « Thread »
Top « Date » · « Thread »
From Apache Jenkins Server <jenk...@builds.apache.org>
Subject Build failed in Jenkins: Jena_TDB #358
Date Sat, 19 Nov 2011 18:05:52 GMT
See <https://builds.apache.org/job/Jena_TDB/358/changes>

Changes:

[andy] Use .end() for the end of a transaction, not .close().

------------------------------------------
Started by an SCM change
Building remotely on ubuntu3
Cleaning up <https://builds.apache.org/job/Jena_TDB/ws/trunk>
Deleting <https://builds.apache.org/job/Jena_TDB/ws/trunk/target>
Deleting <https://builds.apache.org/job/Jena_TDB/ws/trunk/tmp>
Updating http://svn.apache.org/repos/asf/incubator/jena/Jena2/TDB/trunk
U         src/test/java/com/hp/hpl/jena/tdb/TestTDBFactory.java
U         src/test/java/com/hp/hpl/jena/tdb/transaction/T_TransSystem.java
U         src/test/java/com/hp/hpl/jena/tdb/transaction/T_TransSystemMultiDatasets.java
U         src/test/java/com/hp/hpl/jena/tdb/transaction/AbstractTestTransSeq.java
U         src/test/java/com/hp/hpl/jena/tdb/transaction/TestTransRestart.java
U         src/test/java/com/hp/hpl/jena/tdb/junit/GraphLocation.java
U         src/test/java/com/hp/hpl/jena/tdb/store/TestLoader.java
U         src/main/java/tdb/tools/dumpnodetable.java
U         src/main/java/com/hp/hpl/jena/tdb/DatasetGraphTxn.java
U         src/main/java/com/hp/hpl/jena/tdb/TDBFactory.java
U         src/main/java/com/hp/hpl/jena/tdb/transaction/TransactionManager.java
U         src/main/java/com/hp/hpl/jena/tdb/migrate/DatasetGraphTrackActive.java
U         src/main/java/com/hp/hpl/jena/tdb/store/GraphTDBBase.java
U         src/main/java/com/hp/hpl/jena/tdb/DatasetGraphTransaction.java
U         src/main/java/com/hp/hpl/jena/tdb/TDBFactoryTxn.java
U         src/main/java/com/hp/hpl/jena/tdb/assembler/DatasetAssemblerTDB.java
U         src/main/java/com/hp/hpl/jena/tdb/sys/SystemTDB.java
U         src/main/java/com/hp/hpl/jena/tdb/sys/DatasetGraphMakerTDB.java
U         src/main/java/com/hp/hpl/jena/tdb/sys/TDBMaker.java
A         src-dev/dev/TDBTxnDeadlockTest.java
At revision 1204031
Parsing POMs
Modules changed, recalculating dependency graph
[trunk] $ /home/hudson/tools/java/latest1.6/bin/java -cp /home/jenkins/jenkins-slave/maven3-agent.jar:/home/hudson/tools/maven/apache-maven-3.0.3/boot/plexus-classworlds-2.4.jar
org.jvnet.hudson.maven3.agent.Maven3Main /home/hudson/tools/maven/apache-maven-3.0.3 /x1/jenkins/jenkins-slave/slave.jar
/home/jenkins/jenkins-slave/maven3-interceptor.jar 51749
<===[JENKINS REMOTING CAPACITY]===>   channel started
Executing Maven:  -B -f <https://builds.apache.org/job/Jena_TDB/ws/trunk/pom.xml> clean
install
[INFO] Scanning for projects...
[WARNING] 
[WARNING] Some problems were encountered while building the effective model for org.apache.jena:jena-tdb:jar:0.9.0-incubating-SNAPSHOT
[WARNING] 'version' contains an expression but should be a constant. @ org.apache.jena:jena-tdb:${ver.tdb},
<https://builds.apache.org/job/Jena_TDB/ws/trunk/pom.xml,> line 11, column 12
[WARNING] 
[WARNING] It is highly recommended to fix these problems because they threaten the stability
of your build.
[WARNING] 
[WARNING] For this reason, future Maven versions might no longer support building such malformed
projects.
[WARNING] 
[INFO]                                                                         
[INFO] ------------------------------------------------------------------------
[INFO] Building TDB 0.9.0-incubating-SNAPSHOT
[INFO] ------------------------------------------------------------------------
[INFO] 
[INFO] --- maven-clean-plugin:2.4.1:clean (default-clean) @ jena-tdb ---
[INFO] 
[INFO] --- maven-remote-resources-plugin:1.2.1:process (default) @ jena-tdb ---
[INFO] 
[INFO] --- maven-antrun-plugin:1.6:run (ant-timestamp) @ jena-tdb ---
[INFO] Executing tasks

main:
     [echo] version=0.9.0-incubating-SNAPSHOT
     [echo] build.time=2011-11-19 18:05 UTC
[INFO] Executed tasks
[INFO] 
[INFO] --- maven-resources-plugin:2.5:resources (default-resources) @ jena-tdb ---
[debug] execute contextualize
[INFO] Using 'UTF-8' encoding to copy filtered resources.
[INFO] Copying 1 resource to com/hp/hpl/jena/tdb/
[INFO] Copying 3 resources
[INFO] 
[INFO] --- maven-compiler-plugin:2.3.2:compile (default-compile) @ jena-tdb ---
[INFO] Compiling 269 source files to <https://builds.apache.org/job/Jena_TDB/ws/trunk/target/classes>
[INFO] -------------------------------------------------------------
[ERROR] COMPILATION ERROR : 
[INFO] -------------------------------------------------------------
[ERROR] <https://builds.apache.org/job/Jena_TDB/ws/trunk/src/main/java/com/hp/hpl/jena/tdb/migrate/DatasetGraphTrackActive.java>:[72,4]
method does not override or implement a method from a supertype
[INFO] 1 error
[INFO] -------------------------------------------------------------
[JENKINS] Archiving disabled - not archiving <https://builds.apache.org/job/Jena_TDB/ws/trunk/pom.xml>
[INFO] ------------------------------------------------------------------------
[INFO] BUILD FAILURE
[INFO] ------------------------------------------------------------------------
[INFO] Total time: 7.664s
[INFO] Finished at: Sat Nov 19 18:05:51 UTC 2011
[INFO] Final Memory: 17M/116M
[INFO] ------------------------------------------------------------------------
Waiting for Jenkins to finish collecting data
mavenExecutionResult exceptions not empty
message : Failed to execute goal org.apache.maven.plugins:maven-compiler-plugin:2.3.2:compile
(default-compile) on project jena-tdb: Compilation failure
<https://builds.apache.org/job/Jena_TDB/ws/trunk/src/main/java/com/hp/hpl/jena/tdb/migrate/DatasetGraphTrackActive.java>:[72,4]
method does not override or implement a method from a supertype

cause : Compilation failure
<https://builds.apache.org/job/Jena_TDB/ws/trunk/src/main/java/com/hp/hpl/jena/tdb/migrate/DatasetGraphTrackActive.java>:[72,4]
method does not override or implement a method from a supertype

Stack trace : 
org.apache.maven.lifecycle.LifecycleExecutionException: Failed to execute goal org.apache.maven.plugins:maven-compiler-plugin:2.3.2:compile
(default-compile) on project jena-tdb: Compilation failure
<https://builds.apache.org/job/Jena_TDB/ws/trunk/src/main/java/com/hp/hpl/jena/tdb/migrate/DatasetGraphTrackActive.java>:[72,4]
method does not override or implement a method from a supertype

	at org.apache.maven.lifecycle.internal.MojoExecutor.execute(MojoExecutor.java:213)
	at org.apache.maven.lifecycle.internal.MojoExecutor.execute(MojoExecutor.java:153)
	at org.apache.maven.lifecycle.internal.MojoExecutor.execute(MojoExecutor.java:145)
	at org.apache.maven.lifecycle.internal.LifecycleModuleBuilder.buildProject(LifecycleModuleBuilder.java:84)
	at org.apache.maven.lifecycle.internal.LifecycleModuleBuilder.buildProject(LifecycleModuleBuilder.java:59)
	at org.apache.maven.lifecycle.internal.LifecycleStarter.singleThreadedBuild(LifecycleStarter.java:183)
	at org.apache.maven.lifecycle.internal.LifecycleStarter.execute(LifecycleStarter.java:161)
	at org.apache.maven.DefaultMaven.doExecute(DefaultMaven.java:319)
	at org.apache.maven.DefaultMaven.execute(DefaultMaven.java:156)
	at org.jvnet.hudson.maven3.launcher.Maven3Launcher.main(Maven3Launcher.java:79)
	at sun.reflect.NativeMethodAccessorImpl.invoke0(Native Method)
	at sun.reflect.NativeMethodAccessorImpl.invoke(NativeMethodAccessorImpl.java:39)
	at sun.reflect.DelegatingMethodAccessorImpl.invoke(DelegatingMethodAccessorImpl.java:25)
	at java.lang.reflect.Method.invoke(Method.java:597)
	at org.codehaus.plexus.classworlds.launcher.Launcher.launchStandard(Launcher.java:329)
	at org.codehaus.plexus.classworlds.launcher.Launcher.launch(Launcher.java:239)
	at org.jvnet.hudson.maven3.agent.Maven3Main.launch(Maven3Main.java:158)
	at hudson.maven.Maven3Builder.call(Maven3Builder.java:122)
	at hudson.maven.Maven3Builder.call(Maven3Builder.java:74)
	at hudson.remoting.UserRequest.perform(UserRequest.java:118)
	at hudson.remoting.UserRequest.perform(UserRequest.java:48)
	at hudson.remoting.Request$2.run(Request.java:287)
	at java.util.concurrent.Executors$RunnableAdapter.call(Executors.java:441)
	at java.util.concurrent.FutureTask$Sync.innerRun(FutureTask.java:303)
	at java.util.concurrent.FutureTask.run(FutureTask.java:138)
	at java.util.concurrent.ThreadPoolExecutor$Worker.runTask(ThreadPoolExecutor.java:886)
	at java.util.concurrent.ThreadPoolExecutor$Worker.run(ThreadPoolExecutor.java:908)
	at java.lang.Thread.run(Thread.java:662)
Caused by: org.apache.maven.plugin.CompilationFailureException: Compilation failure
<https://builds.apache.org/job/Jena_TDB/ws/trunk/src/main/java/com/hp/hpl/jena/tdb/migrate/DatasetGraphTrackActive.java>:[72,4]
method does not override or implement a method from a supertype

	at org.apache.maven.plugin.AbstractCompilerMojo.execute(AbstractCompilerMojo.java:656)
	at org.apache.maven.plugin.CompilerMojo.execute(CompilerMojo.java:128)
	at org.apache.maven.plugin.DefaultBuildPluginManager.executeMojo(DefaultBuildPluginManager.java:101)
	at org.apache.maven.lifecycle.internal.MojoExecutor.execute(MojoExecutor.java:209)
	... 27 more
Sending e-mails to: jena-commits@incubator.apache.org
channel stopped


Mime
View raw message