jena-commits mailing list archives

Site index · List index
Message view « Date » · « Thread »
Top « Date » · « Thread »
From Apache Jenkins Server <jenk...@builds.apache.org>
Subject Build failed in Jenkins: Jena_SDB » SDB #133
Date Sat, 08 Oct 2011 18:41:38 GMT
See <https://builds.apache.org/job/Jena_SDB/com.hp.hpl.jena$sdb/133/changes>

Changes:

[andy] Keep aligned to development ARQ

------------------------------------------
<===[JENKINS REMOTING CAPACITY]===>   channel started
Executing Maven:  -B -f <https://builds.apache.org/job/Jena_SDB/com.hp.hpl.jena$sdb/ws/pom.xml>
clean install
[INFO] Scanning for projects...
[INFO]                                                                         
[INFO] ------------------------------------------------------------------------
[INFO] Building SDB 1.3.5-SNAPSHOT
[INFO] ------------------------------------------------------------------------
[INFO] 
[INFO] --- maven-clean-plugin:2.4.1:clean (default-clean) @ sdb ---
[INFO] Deleting <https://builds.apache.org/job/Jena_SDB/com.hp.hpl.jena$sdb/ws/target>
[INFO] 
[INFO] --- maven-antrun-plugin:1.3:run (ant-timestamp) @ sdb ---
[INFO] Executing tasks
    [mkdir] Created dir: <https://builds.apache.org/job/Jena_SDB/com.hp.hpl.jena$sdb/ws/target>
     [echo] version=1.3.5-SNAPSHOT
     [echo] build.time=2011-10-08 18:41 +0000
[INFO] Executed tasks
[INFO] 
[INFO] --- maven-resources-plugin:2.5:resources (default-resources) @ sdb ---
[debug] execute contextualize
[INFO] Using 'UTF-8' encoding to copy filtered resources.
[INFO] Copying 1 resource to com/hp/hpl/jena/sdb/
[INFO] 
[INFO] --- maven-compiler-plugin:2.3.2:compile (default-compile) @ sdb ---
[INFO] Compiling 353 source files to <https://builds.apache.org/job/Jena_SDB/com.hp.hpl.jena$sdb/ws/target/classes>
[INFO] -------------------------------------------------------------
[ERROR] COMPILATION ERROR : 
[INFO] -------------------------------------------------------------
[ERROR] <https://builds.apache.org/job/Jena_SDB/com.hp.hpl.jena$sdb/ws/src/com/hp/hpl/jena/sdb/SDB.java>:[147,37]
cannot find symbol
symbol  : variable arqParamNS
location: class com.hp.hpl.jena.query.ARQ
[ERROR] <https://builds.apache.org/job/Jena_SDB/com.hp.hpl.jena$sdb/ws/src/com/hp/hpl/jena/sdb/SDB.java>:[149,32]
cannot find symbol
symbol  : variable arqParamNS
location: class com.hp.hpl.jena.query.ARQ
[INFO] 2 errors 
[INFO] -------------------------------------------------------------
[JENKINS] Archiving disabled - not archiving <https://builds.apache.org/job/Jena_SDB/com.hp.hpl.jena$sdb/ws/pom.xml>


Mime
View raw message