jena-commits mailing list archives

Site index · List index
Message view « Date » · « Thread »
Top « Date » · « Thread »
From Apache Jenkins Server <jenk...@builds.apache.org>
Subject Build failed in Jenkins: Jena_Core #51
Date Fri, 14 Oct 2011 16:57:48 GMT
See <https://builds.apache.org/job/Jena_Core/51/changes>

Changes:

[andy] Apache license in javadoc.

------------------------------------------
[...truncated 4126 lines...]
A         testing\wg\description-logic\premises110.rdf
A         testing\wg\description-logic\inconsistent109.rdf
A         testing\wg\description-logic\inconsistent623.rdf
A         testing\wg\description-logic\premises033.rdf
A         testing\wg\description-logic\inconsistent627.rdf
A         testing\wg\description-logic\conclusions101.rdf
A         testing\wg\description-logic\inconsistent909.rdf
A         testing\wg\description-logic\conclusions105.rdf
A         testing\wg\description-logic\consistent616.rdf
A         testing\wg\description-logic\Manifest011.rdf
A         testing\wg\description-logic\conclusions901.rdf
A         testing\wg\description-logic\conclusions109.rdf
A         testing\wg\description-logic\Manifest015.rdf
A         testing\wg\description-logic\conclusions905.rdf
A         testing\wg\description-logic\conclusions662.rdf
A         testing\wg\description-logic\Manifest610.rdf
A         testing\wg\description-logic\Manifest019.rdf
A         testing\wg\description-logic\Manifest614.rdf
A         testing\wg\description-logic\nonconclusions034.rdf
A         testing\wg\description-logic\inconsistent110.rdf
A         testing\modelspecs
A         testing\modelspecs\schema.n3
A         testing\modelspecs\schema2.n3
A         testing\modelspecs\example.rules
A         testing\modelspecs\empty.rules
A         testing\modelspecs\extra.rules
A         testing\modelspecs\modelspec-config.n3
A         testing\xsd
A         testing\xsd\daml+oil-ex-dt.xsd
A         assembly.xml
A         checkCopyright.pl
AU        fixCopy
A         INSTALL.txt
AU        test.bat
A         readme.html
A         src-examples
A         src-examples\data
A         src-examples\data\test1.owl
A         src-examples\data\test2.owl
A         src-examples\data\eswc-2006-09-21.rdf
A         src-examples\data\camera.owl
A         src-examples\jena
A         src-examples\jena\examples
A         src-examples\jena\examples\ontology
A         src-examples\jena\examples\ontology\classHierarchy
A         src-examples\jena\examples\ontology\classHierarchy\ClassHierarchy.java
A         src-examples\jena\examples\ontology\classHierarchy\Main.java
A         src-examples\jena\examples\ontology\describeClass
A         src-examples\jena\examples\ontology\describeClass\Main.java
A         src-examples\jena\examples\ontology\describeClass\DescribeClass.java
A         src-examples\jena\examples\ontology\persistentOntology
A         src-examples\jena\examples\ontology\persistentOntology\Main.java
A         src-examples\jena\examples\ontology\persistentOntology\PersistentOntology.java
A         src-examples\jena\examples\rdf
A         src-examples\jena\examples\rdf\Tutorial01.java
A         src-examples\jena\examples\rdf\Tutorial10.java
A         src-examples\jena\examples\rdf\Tutorial02.java
A         src-examples\jena\examples\rdf\Tutorial11.java
A         src-examples\jena\examples\rdf\Tutorial03.java
A         src-examples\jena\examples\rdf\Tutorial04.java
A         src-examples\jena\examples\rdf\Tutorial05.java
A         src-examples\jena\examples\rdf\Tutorial06.java
A         src-examples\jena\examples\rdf\Tutorial07.java
A         src-examples\jena\examples\rdf\Tutorial08.java
A         src-examples\jena\examples\rdf\Tutorial09.java
A         tools-lib
AU        tools-lib\nekohtml-0.9.4.jar
AU        tools-lib\java2html.jar
AU        tools-lib\rdf-html.jar
A         internal-tools
A         internal-tools\README.text
A         etc
A         etc\owl-fb.rules
A         etc\rdfs-b-tuned.rules
AU        etc\ont-policy-test.rdf
A         etc\dig-daml-axioms.rdf
AU        etc\owl-fb-micro.rules
AU        etc\rdfs.rules
A         etc\rdfs-fb-tgc.rules
AU        etc\owl.rules
A         etc\owl-fb-old.rules
A         etc\mssql.sql
AU        etc\postgresql.sql
A         etc\db-default-drivers.n3
A         etc\rdfs-fb-lp-expt.rules
AU        etc\derby.sql
AU        etc\mysql.sql
AU        etc\oracle.sql
A         etc\schemagen.rdf
AU        etc\hsql.sql
AU        etc\generic_generic.sql
A         etc\rdfs-b.rules
A         etc\ont-policy.rdf
AU        etc\owl-fb-mini.rules
A         etc\owl-b.rules
A         etc\rdfs-fb-tgc-noresource.rules
A         etc\rdfs-noresource.rules
A         etc\dig-owl-axioms.rdf
A         etc\location-mapping.ex
A         etc\rdfs-fb.rules
A         etc\daml-micro.rules
A         etc\test.sql
A         etc\rdfs-fb-tgc-simple.rules
A         README.txt
A         pom2.xml
A         .settings
A         .settings\org.eclipse.jdt.core.prefs
A         .settings\org.eclipse.core.runtime.prefs
A         .settings\org.eclipse.jdt.ui.prefs
A         .settings\org.eclipse.core.resources.prefs
 U        .
At revision 1183421
Parsing POMs
[trunk] $ f:\hudson\tools\java\latest-1.6-64/bin/java -cp f:\hudson\hudson-slave\maven3-agent.jar;f:\hudson\hudson-slave\tools\Maven_3.0.3\boot\plexus-classworlds-2.4.jar
org.jvnet.hudson.maven3.agent.Maven3Main f:\hudson\hudson-slave\tools\Maven_3.0.3 C:\Users\hudson\AppData\LocalLow\Sun\Java\Deployment\cache\6.0\39\4bb6b7e7-37a2a9b8
f:\hudson\hudson-slave\maven3-interceptor.jar 58426
<===[JENKINS REMOTING CAPACITY]===>   channel started
Executing Maven:  -B -f <https://builds.apache.org/job/Jena_Core/ws/trunk\pom.xml> clean
install
[INFO] Scanning for projects...
[WARNING] 
[WARNING] Some problems were encountered while building the effective model for com.hp.hpl.jena:jena:jar:2.6.5-SNAPSHOT
[WARNING] 'build.plugins.plugin.version' for org.apache.maven.plugins:maven-jar-plugin is
missing. @ line 264, column 15
[WARNING] 
[WARNING] It is highly recommended to fix these problems because they threaten the stability
of your build.
[WARNING] 
[WARNING] For this reason, future Maven versions might no longer support building such malformed
projects.
[WARNING] 
[INFO]                                                                         
[INFO] ------------------------------------------------------------------------
[INFO] Building Jena 2.6.5-SNAPSHOT
[INFO] ------------------------------------------------------------------------
[INFO] 
[INFO] --- maven-clean-plugin:2.4.1:clean (default-clean) @ jena ---
[INFO] 
[INFO] --- maven-resources-plugin:2.5:resources (default-resources) @ jena ---
[debug] execute contextualize
[INFO] Using 'UTF-8' encoding to copy filtered resources.
[INFO] Copying 31 resources to etc
[INFO] Copying 1 resource
[INFO] 
[INFO] --- maven-antrun-plugin:1.3:run (default) @ jena ---
[INFO] Executing tasks
     [echo] version=2.6.5-SNAPSHOT
     [echo] build.time=2011-10-14 17:56 BST
     [copy] Copying 1 file to <https://builds.apache.org/job/Jena_Core/ws/trunk\target\classes\com\hp\hpl\jena>
[INFO] Executed tasks
[INFO] 
[INFO] --- maven-compiler-plugin:2.3.2:compile (default-compile) @ jena ---
[INFO] Compiling 917 source files to <https://builds.apache.org/job/Jena_Core/ws/trunk\target\classes>
[INFO] 
[INFO] --- maven-resources-plugin:2.5:testResources (default-testResources) @ jena ---
[debug] execute contextualize
[INFO] Using 'UTF-8' encoding to copy filtered resources.
[INFO] skip non existing resourceDirectory <https://builds.apache.org/job/Jena_Core/ws/trunk\src\test\resources>
[INFO] 
[INFO] --- maven-compiler-plugin:2.3.2:testCompile (default-testCompile) @ jena ---
[INFO] Compiling 401 source files to <https://builds.apache.org/job/Jena_Core/ws/trunk\target\test-classes>
[INFO] 
[INFO] --- maven-surefire-plugin:2.9:test (default-test) @ jena ---
[INFO] Surefire report directory: <https://builds.apache.org/job/Jena_Core/ws/trunk\target\surefire-reports>

-------------------------------------------------------
 T E S T S
-------------------------------------------------------
Running com.hp.hpl.jena.test.TestPackage
 WARN [main] (LiteralLabelImpl.java:129) - inventing a datatype for class java.sql.Date
 WARN [main] (LiteralLabelImpl.java:129) - inventing a datatype for class com.hp.hpl.jena.rdf.model.impl.ResourceImpl
 WARN [main] (LiteralLabelImpl.java:129) - inventing a datatype for class java.lang.Object
 WARN [main] (LiteralLabelImpl.java:129) - inventing a datatype for class com.hp.hpl.jena.regression.Regression$LitTestObj
 WARN [main] (LiteralLabelImpl.java:129) - inventing a datatype for class com.hp.hpl.jena.graph.Triple
Tests run: 9477, Failures: 0, Errors: 0, Skipped: 0, Time elapsed: 37.958 sec

Results :

Tests run: 9477, Failures: 0, Errors: 0, Skipped: 0

[JENKINS] Recording test results
log4j:WARN No appenders could be found for logger (org.apache.commons.beanutils.converters.BooleanConverter).
log4j:WARN Please initialize the log4j system properly.
[INFO] 
[INFO] --- maven-jar-plugin:2.3.1:jar (default-jar) @ jena ---
[INFO] Building jar: <https://builds.apache.org/job/Jena_Core/ws/trunk\target\jena-2.6.5-SNAPSHOT.jar>
[INFO] 
[INFO] --- maven-source-plugin:2.1.2:jar-no-fork (attach-sources) @ jena ---
[INFO] jena-log4j.properties already added, skipping
[INFO] Building jar: <https://builds.apache.org/job/Jena_Core/ws/trunk\target\jena-2.6.5-SNAPSHOT-sources.jar>
[INFO] jena-log4j.properties already added, skipping
[INFO] 
[INFO] --- maven-source-plugin:2.1.2:test-jar-no-fork (attach-sources-test) @ jena ---
[INFO] Building jar: <https://builds.apache.org/job/Jena_Core/ws/trunk\target\jena-2.6.5-SNAPSHOT-test-sources.jar>
[INFO] 
[INFO] --- maven-javadoc-plugin:2.8:jar (attach-javadocs) @ jena ---
[JENKINS] Archiving disabled - not archiving <https://builds.apache.org/job/Jena_Core/ws/trunk\pom.xml>
[JENKINS] Archiving disabled - not archiving <https://builds.apache.org/job/Jena_Core/ws/trunk\target\jena-2.6.5-SNAPSHOT.jar>
[JENKINS] Archiving disabled - not archiving <https://builds.apache.org/job/Jena_Core/ws/trunk\target\jena-2.6.5-SNAPSHOT-sources.jar>
[JENKINS] Archiving disabled - not archiving <https://builds.apache.org/job/Jena_Core/ws/trunk\target\jena-2.6.5-SNAPSHOT-test-sources.jar>
[INFO] ------------------------------------------------------------------------
[INFO] BUILD FAILURE
[INFO] ------------------------------------------------------------------------
[INFO] Total time: 1:05.668s
[INFO] Finished at: Fri Oct 14 17:57:44 BST 2011
[INFO] Final Memory: 26M/221M
[INFO] ------------------------------------------------------------------------
mavenExecutionResult exceptions not empty
message : Failed to execute goal org.apache.maven.plugins:maven-javadoc-plugin:2.8:jar (attach-javadocs)
on project jena: Unable to parse configuration of mojo org.apache.maven.plugins:maven-javadoc-plugin:2.8:jar:
When configuring a basic element the configuration cannot contain any child elements. Configuration
element 'bottom'.
cause : Unable to parse configuration of mojo org.apache.maven.plugins:maven-javadoc-plugin:2.8:jar:
When configuring a basic element the configuration cannot contain any child elements. Configuration
element 'bottom'.
Stack trace : 
org.apache.maven.lifecycle.LifecycleExecutionException: Failed to execute goal org.apache.maven.plugins:maven-javadoc-plugin:2.8:jar
(attach-javadocs) on project jena: Unable to parse configuration of mojo org.apache.maven.plugins:maven-javadoc-plugin:2.8:jar:
When configuring a basic element the configuration cannot contain any child elements. Configuration
element 'bottom'.
	at org.apache.maven.lifecycle.internal.MojoExecutor.execute(MojoExecutor.java:221)
	at org.apache.maven.lifecycle.internal.MojoExecutor.execute(MojoExecutor.java:153)
	at org.apache.maven.lifecycle.internal.MojoExecutor.execute(MojoExecutor.java:145)
	at org.apache.maven.lifecycle.internal.LifecycleModuleBuilder.buildProject(LifecycleModuleBuilder.java:84)
	at org.apache.maven.lifecycle.internal.LifecycleModuleBuilder.buildProject(LifecycleModuleBuilder.java:59)
	at org.apache.maven.lifecycle.internal.LifecycleStarter.singleThreadedBuild(LifecycleStarter.java:183)
	at org.apache.maven.lifecycle.internal.LifecycleStarter.execute(LifecycleStarter.java:161)
	at org.apache.maven.DefaultMaven.doExecute(DefaultMaven.java:319)
	at org.apache.maven.DefaultMaven.execute(DefaultMaven.java:156)
	at org.jvnet.hudson.maven3.launcher.Maven3Launcher.main(Maven3Launcher.java:79)
	at sun.reflect.NativeMethodAccessorImpl.invoke0(Native Method)
	at sun.reflect.NativeMethodAccessorImpl.invoke(NativeMethodAccessorImpl.java:39)
	at sun.reflect.DelegatingMethodAccessorImpl.invoke(DelegatingMethodAccessorImpl.java:25)
	at java.lang.reflect.Method.invoke(Method.java:597)
	at org.codehaus.plexus.classworlds.launcher.Launcher.launchStandard(Launcher.java:329)
	at org.codehaus.plexus.classworlds.launcher.Launcher.launch(Launcher.java:239)
	at org.jvnet.hudson.maven3.agent.Maven3Main.launch(Maven3Main.java:158)
	at hudson.maven.Maven3Builder.call(Maven3Builder.java:122)
	at hudson.maven.Maven3Builder.call(Maven3Builder.java:74)
	at hudson.remoting.UserRequest.perform(UserRequest.java:118)
	at hudson.remoting.UserRequest.perform(UserRequest.java:48)
	at hudson.remoting.Request$2.run(Request.java:287)
	at java.util.concurrent.Executors$RunnableAdapter.call(Executors.java:441)
	at java.util.concurrent.FutureTask$Sync.innerRun(FutureTask.java:303)
	at java.util.concurrent.FutureTask.run(FutureTask.java:138)
	at java.util.concurrent.ThreadPoolExecutor$Worker.runTask(ThreadPoolExecutor.java:886)
	at java.util.concurrent.ThreadPoolExecutor$Worker.run(ThreadPoolExecutor.java:908)
	at java.lang.Thread.run(Thread.java:662)
Caused by: org.apache.maven.plugin.PluginConfigurationException: Unable to parse configuration
of mojo org.apache.maven.plugins:maven-javadoc-plugin:2.8:jar: When configuring a basic element
the configuration cannot contain any child elements. Configuration element 'bottom'.
	at org.apache.maven.plugin.internal.DefaultMavenPluginManager.populatePluginFields(DefaultMavenPluginManager.java:597)
	at org.apache.maven.plugin.internal.DefaultMavenPluginManager.getConfiguredMojo(DefaultMavenPluginManager.java:529)
	at org.apache.maven.plugin.DefaultBuildPluginManager.executeMojo(DefaultBuildPluginManager.java:92)
	at org.apache.maven.lifecycle.internal.MojoExecutor.execute(MojoExecutor.java:209)
	... 27 more
Caused by: org.codehaus.plexus.component.configurator.ComponentConfigurationException: When
configuring a basic element the configuration cannot contain any child elements. Configuration
element 'bottom'.
	at org.codehaus.plexus.component.configurator.converters.basic.AbstractBasicConverter.fromConfiguration(AbstractBasicConverter.java:122)
	at org.codehaus.plexus.component.configurator.converters.ComponentValueSetter.configure(ComponentValueSetter.java:331)
	at org.codehaus.plexus.component.configurator.converters.composite.ObjectWithFieldsConverter.processConfiguration(ObjectWithFieldsConverter.java:151)
	at org.codehaus.plexus.component.configurator.BasicComponentConfigurator.configureComponent(BasicComponentConfigurator.java:56)
	at org.apache.maven.plugin.internal.DefaultMavenPluginManager.populatePluginFields(DefaultMavenPluginManager.java:567)
	... 30 more
Sending e-mails to: jena-commits@incubator.apache.org
channel stopped


Mime
View raw message