jena-commits mailing list archives

Site index · List index
Message view « Date » · « Thread »
Top « Date » · « Thread »
From Apache Jenkins Server <jenk...@builds.apache.org>
Subject Build failed in Jenkins: Jena_IRI #27
Date Sat, 29 Oct 2011 00:51:45 GMT
See <https://builds.apache.org/job/Jena_IRI/27/>

------------------------------------------
Started by upstream project "Jena_Top_Snapshot" build number 7
Building remotely on ubuntu4
Cleaning up <https://builds.apache.org/job/Jena_IRI/ws/trunk>
Updating http://svn.apache.org/repos/asf/incubator/jena/Jena2/IRI/trunk
At revision 1190718
no change for http://svn.apache.org/repos/asf/incubator/jena/Jena2/IRI/trunk since the previous
build
Parsing POMs
Downloaded artifact http://repository.apache.org/snapshots//org/apache/jena/jena-top/0-incubating-SNAPSHOT/maven-metadata.xml
Downloaded artifact http://repository.apache.org/snapshots//org/apache/jena/jena-top/0-incubating-SNAPSHOT/jena-top-0-incubating-20111029.004154-11.pom
Modules changed, recalculating dependency graph
[trunk] $ /home/hudson/tools/java/latest1.6/bin/java -cp /home/jenkins/jenkins-slave/maven-agent.jar:/home/jenkins/jenkins-slave/classworlds.jar
hudson.maven.agent.Main /home/hudson/tools/maven/latest2 /home/jenkins/jenkins-slave/slave.jar
/home/jenkins/jenkins-slave/maven-interceptor.jar 49280
<===[JENKINS REMOTING CAPACITY]===>channel started
   Executing Maven:  -B -f <https://builds.apache.org/job/Jena_IRI/ws/trunk/pom.xml>
clean install
[INFO] Scanning for projects...
[INFO] ------------------------------------------------------------------------
[ERROR] FATAL ERROR
[INFO] ------------------------------------------------------------------------
[INFO] Error building POM (may not be this project's POM).


Project ID: org.apache.jena:jena-iri:jar:0.9.0-incubating-SNAPSHOT

Reason: Cannot find parent: org.apache.jena:jena-top for project: org.apache.jena:jena-iri:jar:0.9.0-incubating-SNAPSHOT
for project org.apache.jena:jena-iri:jar:0.9.0-incubating-SNAPSHOT


[INFO] ------------------------------------------------------------------------
[INFO] Trace
org.apache.maven.reactor.MavenExecutionException: Cannot find parent: org.apache.jena:jena-top
for project: org.apache.jena:jena-iri:jar:0.9.0-incubating-SNAPSHOT for project org.apache.jena:jena-iri:jar:0.9.0-incubating-SNAPSHOT
	at org.apache.maven.DefaultMaven.getProjects(DefaultMaven.java:378)
	at org.apache.maven.DefaultMaven.doExecute(DefaultMaven.java:292)
	at org.apache.maven.DefaultMaven.execute(DefaultMaven.java:129)
	at org.apache.maven.cli.MavenCli.main(MavenCli.java:287)
	at sun.reflect.NativeMethodAccessorImpl.invoke0(Native Method)
	at sun.reflect.NativeMethodAccessorImpl.invoke(NativeMethodAccessorImpl.java:39)
	at sun.reflect.DelegatingMethodAccessorImpl.invoke(DelegatingMethodAccessorImpl.java:25)
	at java.lang.reflect.Method.invoke(Method.java:597)
	at org.codehaus.classworlds.Launcher.launchEnhanced(Launcher.java:315)
	at org.codehaus.classworlds.Launcher.launch(Launcher.java:255)
	at hudson.maven.agent.Main.launch(Main.java:185)
	at hudson.maven.MavenBuilder.call(MavenBuilder.java:160)
	at hudson.maven.MavenModuleSetBuild$Builder.call(MavenModuleSetBuild.java:1059)
	at hudson.maven.MavenModuleSetBuild$Builder.call(MavenModuleSetBuild.java:990)
	at hudson.remoting.UserRequest.perform(UserRequest.java:118)
	at hudson.remoting.UserRequest.perform(UserRequest.java:48)
	at hudson.remoting.Request$2.run(Request.java:287)
	at java.util.concurrent.Executors$RunnableAdapter.call(Executors.java:441)
	at java.util.concurrent.FutureTask$Sync.innerRun(FutureTask.java:303)
	at java.util.concurrent.FutureTask.run(FutureTask.java:138)
	at java.util.concurrent.ThreadPoolExecutor$Worker.runTask(ThreadPoolExecutor.java:886)
	at java.util.concurrent.ThreadPoolExecutor$Worker.run(ThreadPoolExecutor.java:908)
	at java.lang.Thread.run(Thread.java:662)
Caused by: org.apache.maven.project.ProjectBuildingException: Cannot find parent: org.apache.jena:jena-top
for project: org.apache.jena:jena-iri:jar:0.9.0-incubating-SNAPSHOT for project org.apache.jena:jena-iri:jar:0.9.0-incubating-SNAPSHOT
	at org.apache.maven.project.DefaultMavenProjectBuilder.assembleLineage(DefaultMavenProjectBuilder.java:1370)
	at org.apache.maven.project.DefaultMavenProjectBuilder.buildInternal(DefaultMavenProjectBuilder.java:821)
	at org.apache.maven.project.DefaultMavenProjectBuilder.buildFromSourceFileInternal(DefaultMavenProjectBuilder.java:506)
	at org.apache.maven.project.DefaultMavenProjectBuilder.build(DefaultMavenProjectBuilder.java:198)
	at org.apache.maven.DefaultMaven.getProject(DefaultMaven.java:583)
	at org.apache.maven.DefaultMaven.collectProjects(DefaultMaven.java:461)
	at org.apache.maven.DefaultMaven.getProjects(DefaultMaven.java:365)
	... 22 more
Caused by: org.apache.maven.project.ProjectBuildingException: Error getting POM for 'org.apache.jena:jena-top'
from the repository: Unable to read local copy of metadata: Cannot read metadata from '/home/jenkins/.m2/repository/org/apache/jena/jena-top/0-incubating-SNAPSHOT/maven-metadata-local.xml':
expected START_TAG or END_TAG not TEXT (position: TEXT seen ...<extension>pom</...
@13:25) 
  org.apache.jena:jena-top:pom:0-incubating-SNAPSHOT

 for project org.apache.jena:jena-top
	at org.apache.maven.project.DefaultMavenProjectBuilder.findModelFromRepository(DefaultMavenProjectBuilder.java:590)
	at org.apache.maven.project.DefaultMavenProjectBuilder.assembleLineage(DefaultMavenProjectBuilder.java:1366)
	... 28 more
Caused by: org.apache.maven.artifact.resolver.ArtifactResolutionException: Unable to read
local copy of metadata: Cannot read metadata from '/home/jenkins/.m2/repository/org/apache/jena/jena-top/0-incubating-SNAPSHOT/maven-metadata-local.xml':
expected START_TAG or END_TAG not TEXT (position: TEXT seen ...<extension>pom</...
@13:25) 
  org.apache.jena:jena-top:pom:0-incubating-SNAPSHOT


	at org.apache.maven.artifact.transform.SnapshotTransformation.transformForResolve(SnapshotTransformation.java:68)
	at org.apache.maven.artifact.transform.DefaultArtifactTransformationManager.transformForResolve(DefaultArtifactTransformationManager.java:57)
	at org.apache.maven.artifact.resolver.DefaultArtifactResolver.resolve(DefaultArtifactResolver.java:129)
	at org.apache.maven.artifact.resolver.DefaultArtifactResolver.resolve(DefaultArtifactResolver.java:74)
	at org.apache.maven.project.DefaultMavenProjectBuilder.findModelFromRepository(DefaultMavenProjectBuilder.java:556)
	... 29 more
Caused by: org.apache.maven.artifact.repository.metadata.RepositoryMetadataResolutionException:
Unable to read local copy of metadata: Cannot read metadata from '/home/jenkins/.m2/repository/org/apache/jena/jena-top/0-incubating-SNAPSHOT/maven-metadata-local.xml':
expected START_TAG or END_TAG not TEXT (position: TEXT seen ...<extension>pom</...
@13:25) 
	at org.apache.maven.artifact.repository.metadata.DefaultRepositoryMetadataManager.resolve(DefaultRepositoryMetadataManager.java:175)
	at org.apache.maven.artifact.transform.AbstractVersionTransformation.resolveVersion(AbstractVersionTransformation.java:65)
	at org.apache.maven.artifact.transform.SnapshotTransformation.transformForResolve(SnapshotTransformation.java:63)
	... 33 more
Caused by: org.apache.maven.artifact.repository.metadata.RepositoryMetadataReadException:
Cannot read metadata from '/home/jenkins/.m2/repository/org/apache/jena/jena-top/0-incubating-SNAPSHOT/maven-metadata-local.xml':
expected START_TAG or END_TAG not TEXT (position: TEXT seen ...<extension>pom</...
@13:25) 
	at org.apache.maven.artifact.repository.metadata.DefaultRepositoryMetadataManager.readMetadata(DefaultRepositoryMetadataManager.java:324)
	at org.apache.maven.artifact.repository.metadata.DefaultRepositoryMetadataManager.loadMetadata(DefaultRepositoryMetadataManager.java:276)
	at org.apache.maven.artifact.repository.metadata.DefaultRepositoryMetadataManager.mergeMetadata(DefaultRepositoryMetadataManager.java:205)
	at org.apache.maven.artifact.repository.metadata.DefaultRepositoryMetadataManager.resolve(DefaultRepositoryMetadataManager.java:166)
	... 35 more
Caused by: org.codehaus.plexus.util.xml.pull.XmlPullParserException: expected START_TAG or
END_TAG not TEXT (position: TEXT seen ...<extension>pom</... @13:25) 
	at org.codehaus.plexus.util.xml.pull.MXParser.nextTag(MXParser.java:1083)
	at org.apache.maven.artifact.repository.metadata.io.xpp3.MetadataXpp3Reader.parseVersioning(MetadataXpp3Reader.java:513)
	at org.apache.maven.artifact.repository.metadata.io.xpp3.MetadataXpp3Reader.parseMetadata(MetadataXpp3Reader.java:352)
	at org.apache.maven.artifact.repository.metadata.io.xpp3.MetadataXpp3Reader.read(MetadataXpp3Reader.java:866)
	at org.apache.maven.artifact.repository.metadata.DefaultRepositoryMetadataManager.readMetadata(DefaultRepositoryMetadataManager.java:311)
	... 38 more
[INFO] ------------------------------------------------------------------------
[INFO] Total time: < 1 second
[INFO] Finished at: Sat Oct 29 00:51:44 UTC 2011
[INFO] Final Memory: 2M/61M
[INFO] ------------------------------------------------------------------------
channel stopped


Mime
View raw message