jena-commits mailing list archives

Site index · List index
Message view « Date » · « Thread »
Top « Date » · « Thread »
From Apache Jenkins Server <jenk...@builds.apache.org>
Subject Build failed in Jenkins: Jena_SDB #142
Date Fri, 14 Oct 2011 16:57:09 GMT
See <https://builds.apache.org/job/Jena_SDB/142/changes>

Changes:

[andy] Apache license in javadoc.

------------------------------------------
Started by an SCM change
Building remotely on ubuntu4
Updating http://svn.apache.org/repos/asf/incubator/jena/Jena2/SDB/trunk
U         pom.xml
U         lib/arq-2.8.9-SNAPSHOT-tests.jar
U         lib/arq-2.8.9-SNAPSHOT.jar
U         assembly.xml
U         lib-src/arq-2.8.9-SNAPSHOT-test-sources.jar
U         lib-src/arq-2.8.9-SNAPSHOT-sources.jar
A         pom2.xml
At revision 1183421
Parsing POMs
[trunk] $ /home/hudson/tools/java/latest1.6/bin/java -cp /home/jenkins/jenkins-slave/maven3-agent.jar:/home/jenkins/jenkins-slave/tools/Maven_3.0.3/boot/plexus-classworlds-2.4.jar
org.jvnet.hudson.maven3.agent.Maven3Main /home/jenkins/jenkins-slave/tools/Maven_3.0.3 /home/jenkins/jenkins-slave/slave.jar
/home/jenkins/jenkins-slave/maven3-interceptor.jar 56566
<===[JENKINS REMOTING CAPACITY]===>channel started
   Executing Maven:  -B -f <https://builds.apache.org/job/Jena_SDB/ws/trunk/pom.xml>
clean install
[INFO] Scanning for projects...
[INFO]                                                                         
[INFO] ------------------------------------------------------------------------
[INFO] Building SDB 1.3.5-SNAPSHOT
[INFO] ------------------------------------------------------------------------
[INFO] 
[INFO] --- maven-clean-plugin:2.4.1:clean (default-clean) @ sdb ---
[INFO] Deleting <https://builds.apache.org/job/Jena_SDB/ws/trunk/target>
[INFO] 
[INFO] --- maven-antrun-plugin:1.3:run (ant-timestamp) @ sdb ---
[INFO] Executing tasks
    [mkdir] Created dir: <https://builds.apache.org/job/Jena_SDB/ws/trunk/target>
     [echo] version=1.3.5-SNAPSHOT
     [echo] build.time=2011-10-14 16:56 +0000
[INFO] Executed tasks
[INFO] 
[INFO] --- maven-resources-plugin:2.5:resources (default-resources) @ sdb ---
[debug] execute contextualize
[INFO] Using 'UTF-8' encoding to copy filtered resources.
[INFO] Copying 1 resource to com/hp/hpl/jena/sdb/
[INFO] 
[INFO] --- maven-compiler-plugin:2.3.2:compile (default-compile) @ sdb ---
[INFO] Compiling 353 source files to <https://builds.apache.org/job/Jena_SDB/ws/trunk/target/classes>
[INFO] [debug] execute contextualize
[INFO] Using 'UTF-8' encoding to copy filtered resources.
[INFO] skip non existing resourceDirectory <https://builds.apache.org/job/Jena_SDB/ws/trunk/src/test/resources>

[INFO] --- maven-resources-plugin:2.5:testResources (default-testResources) @ sdb ---
[INFO] 
[INFO] --- maven-compiler-plugin:2.3.2:testCompile (default-testCompile) @ sdb ---
[INFO] Compiling 54 source files to <https://builds.apache.org/job/Jena_SDB/ws/trunk/target/test-classes>
[INFO] 
[INFO] --- maven-surefire-plugin:2.9:test (default-test) @ sdb ---
[INFO] Surefire report directory: <https://builds.apache.org/job/Jena_SDB/ws/trunk/target/surefire-reports>

-------------------------------------------------------
 T E S T S
-------------------------------------------------------
Running com.hp.hpl.jena.sdb.test.SDBTestAll
Tests run: 299, Failures: 0, Errors: 0, Skipped: 0, Time elapsed: 6.019 sec

Results :

Tests run: 299, Failures: 0, Errors: 0, Skipped: 0

[JENKINS] Recording test results
log4j:WARN No appenders could be found for logger (org.apache.commons.beanutils.converters.BooleanConverter).
log4j:WARN Please initialize the log4j system properly.
[INFO] 
[INFO] --- maven-jar-plugin:2.2:jar (default-jar) @ sdb ---
[INFO] Building jar: <https://builds.apache.org/job/Jena_SDB/ws/trunk/target/sdb-1.3.5-SNAPSHOT.jar>
ignoring exception during new ExecutedMojo null
[INFO] 
[INFO] --- maven-source-plugin:2.1.2:jar (attach-sources) @ sdb ---
[INFO] Building jar: <https://builds.apache.org/job/Jena_SDB/ws/trunk/target/sdb-1.3.5-SNAPSHOT-sources.jar>
ignoring exception during new ExecutedMojo null
[INFO] 
[INFO] --- maven-source-plugin:2.1.2:test-jar (attach-sources-test) @ sdb ---
[INFO] Building jar: <https://builds.apache.org/job/Jena_SDB/ws/trunk/target/sdb-1.3.5-SNAPSHOT-test-sources.jar>
[INFO] 
[INFO] --- maven-javadoc-plugin:2.8:jar (attach-javadocs) @ sdb ---
[JENKINS] Archiving disabled - not archiving <https://builds.apache.org/job/Jena_SDB/ws/trunk/pom.xml>
[JENKINS] Archiving disabled - not archiving <https://builds.apache.org/job/Jena_SDB/ws/trunk/target/sdb-1.3.5-SNAPSHOT.jar>
[JENKINS] Archiving disabled - not archiving <https://builds.apache.org/job/Jena_SDB/ws/trunk/target/sdb-1.3.5-SNAPSHOT-sources.jar>
[JENKINS] Archiving disabled - not archiving <https://builds.apache.org/job/Jena_SDB/ws/trunk/target/sdb-1.3.5-SNAPSHOT-test-sources.jar>
[INFO] ------------------------------------------------------------------------
[INFO] BUILD FAILURE
[INFO] ------------------------------------------------------------------------
[INFO] Total time: 58.766s
[INFO] Finished at: Fri Oct 14 16:57:08 UTC 2011
[INFO] Final Memory: 20M/98M
[INFO] ------------------------------------------------------------------------
mavenExecutionResult exceptions not empty
message : Failed to execute goal org.apache.maven.plugins:maven-javadoc-plugin:2.8:jar (attach-javadocs)
on project sdb: Unable to parse configuration of mojo org.apache.maven.plugins:maven-javadoc-plugin:2.8:jar:
When configuring a basic element the configuration cannot contain any child elements. Configuration
element 'bottom'.
cause : Unable to parse configuration of mojo org.apache.maven.plugins:maven-javadoc-plugin:2.8:jar:
When configuring a basic element the configuration cannot contain any child elements. Configuration
element 'bottom'.
Stack trace : 
org.apache.maven.lifecycle.LifecycleExecutionException: Failed to execute goal org.apache.maven.plugins:maven-javadoc-plugin:2.8:jar
(attach-javadocs) on project sdb: Unable to parse configuration of mojo org.apache.maven.plugins:maven-javadoc-plugin:2.8:jar:
When configuring a basic element the configuration cannot contain any child elements. Configuration
element 'bottom'.
	at org.apache.maven.lifecycle.internal.MojoExecutor.execute(MojoExecutor.java:221)
	at org.apache.maven.lifecycle.internal.MojoExecutor.execute(MojoExecutor.java:153)
	at org.apache.maven.lifecycle.internal.MojoExecutor.execute(MojoExecutor.java:145)
	at org.apache.maven.lifecycle.internal.LifecycleModuleBuilder.buildProject(LifecycleModuleBuilder.java:84)
	at org.apache.maven.lifecycle.internal.LifecycleModuleBuilder.buildProject(LifecycleModuleBuilder.java:59)
	at org.apache.maven.lifecycle.internal.LifecycleStarter.singleThreadedBuild(LifecycleStarter.java:183)
	at org.apache.maven.lifecycle.internal.LifecycleStarter.execute(LifecycleStarter.java:161)
	at org.apache.maven.DefaultMaven.doExecute(DefaultMaven.java:319)
	at org.apache.maven.DefaultMaven.execute(DefaultMaven.java:156)
	at org.jvnet.hudson.maven3.launcher.Maven3Launcher.main(Maven3Launcher.java:79)
	at sun.reflect.NativeMethodAccessorImpl.invoke0(Native Method)
	at sun.reflect.NativeMethodAccessorImpl.invoke(NativeMethodAccessorImpl.java:39)
	at sun.reflect.DelegatingMethodAccessorImpl.invoke(DelegatingMethodAccessorImpl.java:25)
	at java.lang.reflect.Method.invoke(Method.java:597)
	at org.codehaus.plexus.classworlds.launcher.Launcher.launchStandard(Launcher.java:329)
	at org.codehaus.plexus.classworlds.launcher.Launcher.launch(Launcher.java:239)
	at org.jvnet.hudson.maven3.agent.Maven3Main.launch(Maven3Main.java:158)
	at hudson.maven.Maven3Builder.call(Maven3Builder.java:122)
	at hudson.maven.Maven3Builder.call(Maven3Builder.java:74)
	at hudson.remoting.UserRequest.perform(UserRequest.java:118)
	at hudson.remoting.UserRequest.perform(UserRequest.java:48)
	at hudson.remoting.Request$2.run(Request.java:287)
	at java.util.concurrent.Executors$RunnableAdapter.call(Executors.java:441)
	at java.util.concurrent.FutureTask$Sync.innerRun(FutureTask.java:303)
	at java.util.concurrent.FutureTask.run(FutureTask.java:138)
	at java.util.concurrent.ThreadPoolExecutor$Worker.runTask(ThreadPoolExecutor.java:886)
	at java.util.concurrent.ThreadPoolExecutor$Worker.run(ThreadPoolExecutor.java:908)
	at java.lang.Thread.run(Thread.java:619)
Caused by: org.apache.maven.plugin.PluginConfigurationException: Unable to parse configuration
of mojo org.apache.maven.plugins:maven-javadoc-plugin:2.8:jar: When configuring a basic element
the configuration cannot contain any child elements. Configuration element 'bottom'.
	at org.apache.maven.plugin.internal.DefaultMavenPluginManager.populatePluginFields(DefaultMavenPluginManager.java:597)
	at org.apache.maven.plugin.internal.DefaultMavenPluginManager.getConfiguredMojo(DefaultMavenPluginManager.java:529)
	at org.apache.maven.plugin.DefaultBuildPluginManager.executeMojo(DefaultBuildPluginManager.java:92)
	at org.apache.maven.lifecycle.internal.MojoExecutor.execute(MojoExecutor.java:209)
	... 27 more
Caused by: org.codehaus.plexus.component.configurator.ComponentConfigurationException: When
configuring a basic element the configuration cannot contain any child elements. Configuration
element 'bottom'.
	at org.codehaus.plexus.component.configurator.converters.basic.AbstractBasicConverter.fromConfiguration(AbstractBasicConverter.java:122)
	at org.codehaus.plexus.component.configurator.converters.ComponentValueSetter.configure(ComponentValueSetter.java:331)
	at org.codehaus.plexus.component.configurator.converters.composite.ObjectWithFieldsConverter.processConfiguration(ObjectWithFieldsConverter.java:151)
	at org.codehaus.plexus.component.configurator.BasicComponentConfigurator.configureComponent(BasicComponentConfigurator.java:56)
	at org.apache.maven.plugin.internal.DefaultMavenPluginManager.populatePluginFields(DefaultMavenPluginManager.java:567)
	... 30 more
Sending e-mails to: jena-commits@incubator.apache.org
channel stopped


Mime
View raw message