jena-commits mailing list archives

Site index · List index
Message view « Date » · « Thread »
Top « Date » · « Thread »
From Apache Jenkins Server <jenk...@builds.apache.org>
Subject Build failed in Jenkins: Jena_SDB #96
Date Sun, 25 Sep 2011 19:48:55 GMT
See <https://builds.apache.org/job/Jena_SDB/96/>

------------------------------------------
Started by upstream project "Jena_ARQ" build number 194
Building remotely on ubuntu2
Updating http://svn.apache.org/repos/asf/incubator/jena/Jena2/SDB/trunk
At revision 1175554
no change for http://svn.apache.org/repos/asf/incubator/jena/Jena2/SDB/trunk since the previous
build
Parsing POMs
[trunk] $ /home/hudson/tools/java/latest1.6/bin/java -cp /home/hudson/hudson-slave/maven3-agent.jar:/home/hudson/hudson-slave/tools/Maven_3.0.3/boot/plexus-classworlds-2.4.jar
org.jvnet.hudson.maven3.agent.Maven3Main /home/hudson/hudson-slave/tools/Maven_3.0.3 /home/hudson/hudson-slave/slave.jar
/home/hudson/hudson-slave/maven3-interceptor.jar 53227
<===[JENKINS REMOTING CAPACITY]===>channel started
   Executing Maven:  -B -f <https://builds.apache.org/job/Jena_SDB/ws/trunk/pom.xml>
clean install
[INFO] Scanning for projects...
[INFO]                                                                         
[INFO] ------------------------------------------------------------------------
[INFO] Building SDB 1.3.5-SNAPSHOT
[INFO] ------------------------------------------------------------------------
Downloading: http://openjena.org/repo-dev/com/hp/hpl/jena/arq/2.8.9-SNAPSHOT/maven-metadata.xml
Downloaded: http://openjena.org/repo-dev/com/hp/hpl/jena/arq/2.8.9-SNAPSHOT/maven-metadata.xml
(355 B at 0.3 KB/sec)
Downloading: http://openjena.org/repo-dev/com/hp/hpl/jena/arq/2.8.9-SNAPSHOT/arq-2.8.9-20110925.194824-38.pom
[WARNING] The POM for com.hp.hpl.jena:arq:jar:2.8.9-20110925.194824-38 is missing, no dependency
information available
Downloading: http://openjena.org/repo-dev/com/hp/hpl/jena/arq/2.8.9-SNAPSHOT/arq-2.8.9-20110925.194824-38.pom
[WARNING] The POM for com.hp.hpl.jena:arq:jar:tests:2.8.9-20110925.194824-38 is missing, no
dependency information available
Downloading: http://openjena.org/repo-dev/com/hp/hpl/jena/arq/2.8.9-SNAPSHOT/arq-2.8.9-20110925.194824-38.jar
Downloading: http://openjena.org/repo-dev/com/hp/hpl/jena/arq/2.8.9-SNAPSHOT/arq-2.8.9-20110925.194824-38-tests.jar
Downloaded: http://openjena.org/repo-dev/com/hp/hpl/jena/arq/2.8.9-SNAPSHOT/arq-2.8.9-20110925.194824-38.jar
(2127 KB at 644.7 KB/sec)
[JENKINS] Archiving disabled - not archiving <https://builds.apache.org/job/Jena_SDB/ws/trunk/pom.xml>
[INFO] ------------------------------------------------------------------------
[INFO] BUILD FAILURE
[INFO] ------------------------------------------------------------------------
[INFO] Total time: 8.660s
[INFO] Finished at: Sun Sep 25 19:48:54 UTC 2011
[INFO] Final Memory: 8M/80M
[INFO] ------------------------------------------------------------------------
mavenExecutionResult exceptions not empty
message : Failed to execute goal on project sdb: Could not resolve dependencies for project
com.hp.hpl.jena:sdb:jar:1.3.5-SNAPSHOT: Could not find artifact com.hp.hpl.jena:arq:jar:tests:2.8.9-20110925.194824-38
in repo-jena-dev (http://openjena.org/repo-dev)
cause : Could not resolve dependencies for project com.hp.hpl.jena:sdb:jar:1.3.5-SNAPSHOT:
Could not find artifact com.hp.hpl.jena:arq:jar:tests:2.8.9-20110925.194824-38 in repo-jena-dev
(http://openjena.org/repo-dev)
Stack trace : 
org.apache.maven.lifecycle.LifecycleExecutionException: Failed to execute goal on project
sdb: Could not resolve dependencies for project com.hp.hpl.jena:sdb:jar:1.3.5-SNAPSHOT: Could
not find artifact com.hp.hpl.jena:arq:jar:tests:2.8.9-20110925.194824-38 in repo-jena-dev
(http://openjena.org/repo-dev)
	at org.apache.maven.lifecycle.internal.LifecycleDependencyResolver.getDependencies(LifecycleDependencyResolver.java:196)
	at org.apache.maven.lifecycle.internal.LifecycleDependencyResolver.resolveProjectDependencies(LifecycleDependencyResolver.java:108)
	at org.apache.maven.lifecycle.internal.MojoExecutor.ensureDependenciesAreResolved(MojoExecutor.java:258)
	at org.apache.maven.lifecycle.internal.MojoExecutor.execute(MojoExecutor.java:201)
	at org.apache.maven.lifecycle.internal.MojoExecutor.execute(MojoExecutor.java:153)
	at org.apache.maven.lifecycle.internal.MojoExecutor.execute(MojoExecutor.java:145)
	at org.apache.maven.lifecycle.internal.LifecycleModuleBuilder.buildProject(LifecycleModuleBuilder.java:84)
	at org.apache.maven.lifecycle.internal.LifecycleModuleBuilder.buildProject(LifecycleModuleBuilder.java:59)
	at org.apache.maven.lifecycle.internal.LifecycleStarter.singleThreadedBuild(LifecycleStarter.java:183)
	at org.apache.maven.lifecycle.internal.LifecycleStarter.execute(LifecycleStarter.java:161)
	at org.apache.maven.DefaultMaven.doExecute(DefaultMaven.java:319)
	at org.apache.maven.DefaultMaven.execute(DefaultMaven.java:156)
	at org.jvnet.hudson.maven3.launcher.Maven3Launcher.main(Maven3Launcher.java:79)
	at sun.reflect.NativeMethodAccessorImpl.invoke0(Native Method)
	at sun.reflect.NativeMethodAccessorImpl.invoke(NativeMethodAccessorImpl.java:39)
	at sun.reflect.DelegatingMethodAccessorImpl.invoke(DelegatingMethodAccessorImpl.java:25)
	at java.lang.reflect.Method.invoke(Method.java:597)
	at org.codehaus.plexus.classworlds.launcher.Launcher.launchStandard(Launcher.java:329)
	at org.codehaus.plexus.classworlds.launcher.Launcher.launch(Launcher.java:239)
	at org.jvnet.hudson.maven3.agent.Maven3Main.launch(Maven3Main.java:158)
	at hudson.maven.Maven3Builder.call(Maven3Builder.java:122)
	at hudson.maven.Maven3Builder.call(Maven3Builder.java:74)
	at hudson.remoting.UserRequest.perform(UserRequest.java:118)
	at hudson.remoting.UserRequest.perform(UserRequest.java:48)
	at hudson.remoting.Request$2.run(Request.java:287)
	at java.util.concurrent.Executors$RunnableAdapter.call(Executors.java:441)
	at java.util.concurrent.FutureTask$Sync.innerRun(FutureTask.java:303)
	at java.util.concurrent.FutureTask.run(FutureTask.java:138)
	at java.util.concurrent.ThreadPoolExecutor$Worker.runTask(ThreadPoolExecutor.java:886)
	at java.util.concurrent.ThreadPoolExecutor$Worker.run(ThreadPoolExecutor.java:908)
	at java.lang.Thread.run(Thread.java:619)
Caused by: org.apache.maven.project.DependencyResolutionException: Could not resolve dependencies
for project com.hp.hpl.jena:sdb:jar:1.3.5-SNAPSHOT: Could not find artifact com.hp.hpl.jena:arq:jar:tests:2.8.9-20110925.194824-38
in repo-jena-dev (http://openjena.org/repo-dev)
	at org.apache.maven.project.DefaultProjectDependenciesResolver.resolve(DefaultProjectDependenciesResolver.java:170)
	at org.apache.maven.lifecycle.internal.LifecycleDependencyResolver.getDependencies(LifecycleDependencyResolver.java:171)
	... 30 more
Caused by: org.sonatype.aether.resolution.DependencyResolutionException: Could not find artifact
com.hp.hpl.jena:arq:jar:tests:2.8.9-20110925.194824-38 in repo-jena-dev (http://openjena.org/repo-dev)
	at org.sonatype.aether.impl.internal.DefaultRepositorySystem.resolveDependencies(DefaultRepositorySystem.java:412)
	at org.apache.maven.project.DefaultProjectDependenciesResolver.resolve(DefaultProjectDependenciesResolver.java:164)
	... 31 more
Caused by: org.sonatype.aether.resolution.ArtifactResolutionException: Could not find artifact
com.hp.hpl.jena:arq:jar:tests:2.8.9-20110925.194824-38 in repo-jena-dev (http://openjena.org/repo-dev)
	at org.sonatype.aether.impl.internal.DefaultArtifactResolver.resolve(DefaultArtifactResolver.java:541)
	at org.sonatype.aether.impl.internal.DefaultArtifactResolver.resolveArtifacts(DefaultArtifactResolver.java:220)
	at org.sonatype.aether.impl.internal.DefaultRepositorySystem.resolveDependencies(DefaultRepositorySystem.java:395)
	... 32 more
Caused by: org.sonatype.aether.transfer.ArtifactNotFoundException: Could not find artifact
com.hp.hpl.jena:arq:jar:tests:2.8.9-20110925.194824-38 in repo-jena-dev (http://openjena.org/repo-dev)
	at org.sonatype.aether.connector.wagon.WagonRepositoryConnector$4.wrap(WagonRepositoryConnector.java:945)
	at org.sonatype.aether.connector.wagon.WagonRepositoryConnector$4.wrap(WagonRepositoryConnector.java:940)
	at org.sonatype.aether.connector.wagon.WagonRepositoryConnector$GetTask.flush(WagonRepositoryConnector.java:695)
	at org.sonatype.aether.connector.wagon.WagonRepositoryConnector$GetTask.flush(WagonRepositoryConnector.java:689)
	at org.sonatype.aether.connector.wagon.WagonRepositoryConnector.get(WagonRepositoryConnector.java:445)
	at org.sonatype.aether.impl.internal.DefaultArtifactResolver.resolve(DefaultArtifactResolver.java:460)
	... 34 more
Sending e-mails to: jena-commits@incubator.apache.org
channel stopped


Mime
View raw message