jena-commits mailing list archives

Site index · List index
Message view « Date » · « Thread »
Top « Date » · « Thread »
From Apache Jenkins Server <jenk...@builds.apache.org>
Subject Build failed in Jenkins: Jena_ARQ #92
Date Thu, 18 Aug 2011 10:21:10 GMT
See <https://builds.apache.org/job/Jena_ARQ/92/>

------------------------------------------
Started by user castagna
Started by upstream project "maven-plugins" build number 404
Building remotely on ubuntu1
Cleaning up <https://builds.apache.org/job/Jena_ARQ/ws/trunk>
Deleting <https://builds.apache.org/job/Jena_ARQ/ws/trunk/target>
Updating http://svn.apache.org/repos/asf/incubator/jena/Jena2/ARQ/trunk
A         src/org/openjena/riot/web
A         src/org/openjena/riot/web/HttpCaptureResponse.java
A         src/org/openjena/riot/web/HttpNames.java
A         src/org/openjena/riot/web/HttpResponseLib.java
A         src/org/openjena/riot/web/HttpResponseHandler.java
A         src/org/openjena/riot/web/ContentProducer.java
A         src/org/openjena/riot/web/HttpOp.java
D         src-dev/riot/web
A         src-dev/dev/RunHTTP.java
U         src-dev/dev/RunARQ.java
At revision 1159138
no change for http://svn.apache.org/repos/asf/incubator/jena/Jena2/ARQ/trunk since the previous
build
 your Apache Maven build is setup to use a config with id  but cannot find the config
 your Apache Maven build is setup to use a global settings config with id  but cannot find
the config
Parsing POMs
ERROR: Failed to parse POMs
hudson.util.IOException2: remote file operation failed: <https://builds.apache.org/job/Jena_ARQ/ws/trunk>
at hudson.remoting.Channel@577495f9:ubuntu1
	at hudson.FilePath.act(FilePath.java:754)
	at hudson.FilePath.act(FilePath.java:740)
	at hudson.maven.MavenModuleSetBuild$RunnerImpl.parsePoms(MavenModuleSetBuild.java:874)
	at hudson.maven.MavenModuleSetBuild$RunnerImpl.doRun(MavenModuleSetBuild.java:644)
	at hudson.model.AbstractBuild$AbstractRunner.run(AbstractBuild.java:448)
	at hudson.model.Run.run(Run.java:1376)
	at hudson.maven.MavenModuleSetBuild.run(MavenModuleSetBuild.java:479)
	at hudson.model.ResourceController.execute(ResourceController.java:88)
	at hudson.model.Executor.run(Executor.java:230)
Caused by: hudson.remoting.ProxyException: hudson.maven.MavenModuleSetBuild$MavenExecutionException:
org.apache.maven.project.ProjectBuildingException: Some problems were encountered while processing
the POMs:
[WARNING] 'build.plugins.plugin.version' for org.apache.maven.plugins:maven-resources-plugin
is missing. @ line 280, column 15
[WARNING] 'build.plugins.plugin.version' for org.apache.maven.plugins:maven-javadoc-plugin
is missing. @ line 225, column 15
[WARNING] 'build.plugins.plugin.version' for org.apache.maven.plugins:maven-compiler-plugin
is missing. @ line 181, column 15
[WARNING] 'build.plugins.plugin.version' for org.apache.maven.plugins:maven-surefire-plugin
is missing. @ line 194, column 15
[WARNING] 'build.plugins.plugin.version' for org.apache.maven.plugins:maven-jar-plugin is
missing. @ line 268, column 15
[ERROR] 'build.plugins.plugin.version' for org.apache.maven.plugins:maven-eclipse-plugin must
be a valid version but is 'RELEASE'. @ line 333, column 11
[WARNING] 'reporting.plugins.plugin.version' for org.apache.maven.plugins:maven-surefire-report-plugin
is missing. @ line 371, column 15
[WARNING] 'reporting.plugins.plugin.version' for org.codehaus.mojo:cobertura-maven-plugin
is missing. @ line 378, column 15
[WARNING] 'reporting.plugins.plugin.version' for org.apache.maven.plugins:maven-checkstyle-plugin
is missing. @ line 389, column 15
[WARNING] 'reporting.plugins.plugin.version' for org.apache.maven.plugins:maven-jxr-plugin
is missing. @ line 393, column 15
[WARNING] 'reporting.plugins.plugin.version' for org.apache.maven.plugins:maven-pmd-plugin
is missing. @ line 397, column 15
[WARNING] 'reporting.plugins.plugin.version' for org.codehaus.mojo:findbugs-maven-plugin is
missing. @ line 408, column 15

	at hudson.maven.MavenModuleSetBuild$PomParser.invoke(MavenModuleSetBuild.java:1408)
	at hudson.maven.MavenModuleSetBuild$PomParser.invoke(MavenModuleSetBuild.java:1187)
	at hudson.FilePath$FileCallableWrapper.call(FilePath.java:1994)
	at hudson.remoting.UserRequest.perform(UserRequest.java:118)
	at hudson.remoting.UserRequest.perform(UserRequest.java:48)
	at hudson.remoting.Request$2.run(Request.java:287)
	at java.util.concurrent.Executors$RunnableAdapter.call(Executors.java:471)
	at java.util.concurrent.FutureTask$Sync.innerRun(FutureTask.java:334)
	at java.util.concurrent.FutureTask.run(FutureTask.java:166)
	at java.util.concurrent.ThreadPoolExecutor.runWorker(ThreadPoolExecutor.java:1110)
	at java.util.concurrent.ThreadPoolExecutor$Worker.run(ThreadPoolExecutor.java:603)
	at java.lang.Thread.run(Thread.java:636)
Caused by: hudson.remoting.ProxyException: org.apache.maven.project.ProjectBuildingException:
Some problems were encountered while processing the POMs:
[WARNING] 'build.plugins.plugin.version' for org.apache.maven.plugins:maven-resources-plugin
is missing. @ line 280, column 15
[WARNING] 'build.plugins.plugin.version' for org.apache.maven.plugins:maven-javadoc-plugin
is missing. @ line 225, column 15
[WARNING] 'build.plugins.plugin.version' for org.apache.maven.plugins:maven-compiler-plugin
is missing. @ line 181, column 15
[WARNING] 'build.plugins.plugin.version' for org.apache.maven.plugins:maven-surefire-plugin
is missing. @ line 194, column 15
[WARNING] 'build.plugins.plugin.version' for org.apache.maven.plugins:maven-jar-plugin is
missing. @ line 268, column 15
[ERROR] 'build.plugins.plugin.version' for org.apache.maven.plugins:maven-eclipse-plugin must
be a valid version but is 'RELEASE'. @ line 333, column 11
[WARNING] 'reporting.plugins.plugin.version' for org.apache.maven.plugins:maven-surefire-report-plugin
is missing. @ line 371, column 15
[WARNING] 'reporting.plugins.plugin.version' for org.codehaus.mojo:cobertura-maven-plugin
is missing. @ line 378, column 15
[WARNING] 'reporting.plugins.plugin.version' for org.apache.maven.plugins:maven-checkstyle-plugin
is missing. @ line 389, column 15
[WARNING] 'reporting.plugins.plugin.version' for org.apache.maven.plugins:maven-jxr-plugin
is missing. @ line 393, column 15
[WARNING] 'reporting.plugins.plugin.version' for org.apache.maven.plugins:maven-pmd-plugin
is missing. @ line 397, column 15
[WARNING] 'reporting.plugins.plugin.version' for org.codehaus.mojo:findbugs-maven-plugin is
missing. @ line 408, column 15

	at org.apache.maven.project.DefaultProjectBuilder.build(DefaultProjectBuilder.java:339)
	at hudson.maven.MavenEmbedder.buildProjects(MavenEmbedder.java:360)
	at hudson.maven.MavenEmbedder.readProjects(MavenEmbedder.java:330)
	at hudson.maven.MavenModuleSetBuild$PomParser.invoke(MavenModuleSetBuild.java:1358)
	... 11 more
FATAL: null
java.lang.NullPointerException
	at hudson.maven.MavenModuleSetBuild$RunnerImpl.doRun(MavenModuleSetBuild.java:833)
	at hudson.model.AbstractBuild$AbstractRunner.run(AbstractBuild.java:448)
	at hudson.model.Run.run(Run.java:1376)
	at hudson.maven.MavenModuleSetBuild.run(MavenModuleSetBuild.java:479)
	at hudson.model.ResourceController.execute(ResourceController.java:88)
	at hudson.model.Executor.run(Executor.java:230)


Mime
View raw message