jclouds-notifications mailing list archives

Site index · List index
Message view « Date » · « Thread »
Top « Date » · « Thread »
From jenkins-no-re...@cloudbees.com
Subject Build failed in Jenkins: jclouds-guava-guice-compat » 18.0,4.0,OpenJDK 7 (latest) #98
Date Tue, 09 Feb 2016 02:56:01 GMT
See <https://jclouds.ci.cloudbees.com/job/jclouds-guava-guice-compat/GUAVA_VERSION=18.0,GUICE_VERSION=4.0,jdk=OpenJDK%207%20(latest)/98/>

------------------------------------------
[...truncated 30511 lines...]
Starting test testDelimiterList(org.jclouds.filesystem.integration.FilesystemContainerIntegrationTest)
[TestNG] Test testDelimiterList(org.jclouds.filesystem.integration.FilesystemContainerIntegrationTest)
succeeded: 9ms
Test suite progress: tests succeeded: 62, failed: 0, skipped: 5.
Starting test testListContainerGetBlobSize(org.jclouds.filesystem.integration.FilesystemContainerIntegrationTest)
[TestNG] Test testListContainerGetBlobSize(org.jclouds.filesystem.integration.FilesystemContainerIntegrationTest)
succeeded: 3ms
Test suite progress: tests succeeded: 63, failed: 0, skipped: 5.
Starting test testListContainerWithZeroMaxResults(org.jclouds.filesystem.integration.FilesystemContainerIntegrationTest)
[TestNG] Test testListContainerWithZeroMaxResults(org.jclouds.filesystem.integration.FilesystemContainerIntegrationTest)
succeeded: 3ms
Test suite progress: tests succeeded: 64, failed: 0, skipped: 5.
Starting test testListMarkerAfterLastKey(org.jclouds.filesystem.integration.FilesystemContainerIntegrationTest)
[TestNG] Test testListMarkerAfterLastKey(org.jclouds.filesystem.integration.FilesystemContainerIntegrationTest)
succeeded: 3ms
Test suite progress: tests succeeded: 65, failed: 0, skipped: 5.
Starting test containerExists(org.jclouds.filesystem.integration.FilesystemContainerIntegrationTest)
[TestNG] Test containerExists(org.jclouds.filesystem.integration.FilesystemContainerIntegrationTest)
succeeded: 1ms
Test suite progress: tests succeeded: 66, failed: 0, skipped: 5.
Starting test deleteContainerIfEmptyWithContents(org.jclouds.filesystem.integration.FilesystemContainerIntegrationTest)
*** allocated new container jenkins-blobstore-7628416284595049515...
[TestNG] Test deleteContainerIfEmptyWithContents(org.jclouds.filesystem.integration.FilesystemContainerIntegrationTest)
failed.
Test suite progress: tests succeeded: 66, failed: 1, skipped: 5.
Starting test deleteContainerIfEmptyWithoutContents(org.jclouds.filesystem.integration.FilesystemContainerIntegrationTest)
*** allocated new container jenkins-blobstore5367668579854402852...
[TestNG] Test deleteContainerIfEmptyWithoutContents(org.jclouds.filesystem.integration.FilesystemContainerIntegrationTest)
succeeded: 3ms
Test suite progress: tests succeeded: 67, failed: 1, skipped: 5.
Starting test deleteContainerWithContents(org.jclouds.filesystem.integration.FilesystemContainerIntegrationTest)
*** allocated new container jenkins-blobstore-1761488194819953667...
[TestNG] Test deleteContainerWithContents(org.jclouds.filesystem.integration.FilesystemContainerIntegrationTest)
succeeded: 2ms
Test suite progress: tests succeeded: 68, failed: 1, skipped: 5.
Starting test deleteContainerWithoutContents(org.jclouds.filesystem.integration.FilesystemContainerIntegrationTest)
*** allocated new container jenkins-blobstore-294017112575058290...
[TestNG] Test deleteContainerWithoutContents(org.jclouds.filesystem.integration.FilesystemContainerIntegrationTest)
succeeded: 1ms
Test suite progress: tests succeeded: 69, failed: 1, skipped: 5.
Starting test testDirectory(org.jclouds.filesystem.integration.FilesystemContainerIntegrationTest)
[TestNG] Test testDirectory(org.jclouds.filesystem.integration.FilesystemContainerIntegrationTest)
skipped.
Test suite progress: tests succeeded: 69, failed: 1, skipped: 6.
Starting test testListContainer(org.jclouds.filesystem.integration.FilesystemContainerIntegrationTest)
[TestNG] Test testListContainer(org.jclouds.filesystem.integration.FilesystemContainerIntegrationTest)
succeeded: 19ms
Test suite progress: tests succeeded: 70, failed: 1, skipped: 6.
Starting test testListContainerMarker(org.jclouds.filesystem.integration.FilesystemContainerIntegrationTest)
[TestNG] Test testListContainerMarker(org.jclouds.filesystem.integration.FilesystemContainerIntegrationTest)
succeeded: 39ms
Test suite progress: tests succeeded: 71, failed: 1, skipped: 6.
Starting test testListContainerMaxResults(org.jclouds.filesystem.integration.FilesystemContainerIntegrationTest)
[TestNG] Test testListContainerMaxResults(org.jclouds.filesystem.integration.FilesystemContainerIntegrationTest)
succeeded: 48ms
Test suite progress: tests succeeded: 72, failed: 1, skipped: 6.
Starting test testListContainerPrefix(org.jclouds.filesystem.integration.FilesystemContainerIntegrationTest)
[TestNG] Test testListContainerPrefix(org.jclouds.filesystem.integration.FilesystemContainerIntegrationTest)
succeeded: 29ms
Test suite progress: tests succeeded: 73, failed: 1, skipped: 6.
Starting test testListRootUsesDelimiter(org.jclouds.filesystem.integration.FilesystemContainerIntegrationTest)
[TestNG] Test testListRootUsesDelimiter(org.jclouds.filesystem.integration.FilesystemContainerIntegrationTest)
succeeded: 27ms
Test suite progress: tests succeeded: 74, failed: 1, skipped: 6.
Starting test testNotWithDetails(org.jclouds.filesystem.integration.FilesystemContainerIntegrationTest)
[TestNG] Test testNotWithDetails(org.jclouds.filesystem.integration.FilesystemContainerIntegrationTest)
succeeded: 3ms
Test suite progress: tests succeeded: 75, failed: 1, skipped: 6.
Starting test testPutTwiceIsOkAndDoesntOverwrite(org.jclouds.filesystem.integration.FilesystemContainerIntegrationTest)
[TestNG] Test testPutTwiceIsOkAndDoesntOverwrite(org.jclouds.filesystem.integration.FilesystemContainerIntegrationTest)
succeeded: 2ms
Test suite progress: tests succeeded: 76, failed: 1, skipped: 6.
Starting test testSetContainerAccess(org.jclouds.filesystem.integration.FilesystemContainerIntegrationTest)
[TestNG] Test testSetContainerAccess(org.jclouds.filesystem.integration.FilesystemContainerIntegrationTest)
skipped.
Test suite progress: tests succeeded: 76, failed: 1, skipped: 7.
Starting test testWithDetails(org.jclouds.filesystem.integration.FilesystemContainerIntegrationTest)
[TestNG] Test testWithDetails(org.jclouds.filesystem.integration.FilesystemContainerIntegrationTest)
succeeded: 3ms
Test suite progress: tests succeeded: 77, failed: 1, skipped: 7.
Tests run: 85, Failures: 1, Errors: 0, Skipped: 7, Time elapsed: 8.36 sec <<< FAILURE!
- in TestSuite
deleteContainerIfEmptyWithContents(org.jclouds.filesystem.integration.FilesystemContainerIntegrationTest)
 Time elapsed: 0.008 sec  <<< FAILURE!
java.lang.RuntimeException: java.nio.file.NoSuchFileException: ./target/basedir/jenkins-blobstore5
	at sun.nio.fs.UnixException.translateToIOException(UnixException.java:86)
	at sun.nio.fs.UnixException.rethrowAsIOException(UnixException.java:102)
	at sun.nio.fs.UnixException.rethrowAsIOException(UnixException.java:107)
	at sun.nio.fs.UnixFileAttributeViews$Basic.readAttributes(UnixFileAttributeViews.java:55)
	at sun.nio.fs.UnixFileSystemProvider.readAttributes(UnixFileSystemProvider.java:144)
	at sun.nio.fs.LinuxFileSystemProvider.readAttributes(LinuxFileSystemProvider.java:97)
	at java.nio.file.Files.readAttributes(Files.java:1686)
	at org.jclouds.filesystem.strategy.internal.FilesystemStorageStrategyImpl.getContainerMetadata(FilesystemStorageStrategyImpl.java:271)
	at org.jclouds.blobstore.config.LocalBlobStore$7.apply(LocalBlobStore.java:436)
	at org.jclouds.blobstore.config.LocalBlobStore$7.apply(LocalBlobStore.java:434)
	at com.google.common.collect.Iterators$8.transform(Iterators.java:799)
	at com.google.common.collect.TransformedIterator.next(TransformedIterator.java:48)
	at com.google.common.collect.Iterators.addAll(Iterators.java:362)
	at com.google.common.collect.Iterables.addAll(Iterables.java:354)
	at org.jclouds.blobstore.domain.internal.PageSetImpl.<init>(PageSetImpl.java:31)
	at org.jclouds.blobstore.config.LocalBlobStore.list(LocalBlobStore.java:433)
	at sun.reflect.GeneratedMethodAccessor11.invoke(Unknown Source)
	at sun.reflect.DelegatingMethodAccessorImpl.invoke(DelegatingMethodAccessorImpl.java:43)
	at java.lang.reflect.Method.invoke(Method.java:606)
	at com.google.inject.internal.DelegatingInvocationHandler.invoke(DelegatingInvocationHandler.java:50)
	at com.sun.proxy.$Proxy44.list(Unknown Source)
	at org.jclouds.blobstore.integration.internal.BaseBlobStoreIntegrationTest.returnContainer(BaseBlobStoreIntegrationTest.java:465)
	at org.jclouds.blobstore.integration.internal.BaseBlobStoreIntegrationTest.recycleContainerAndAddToPool(BaseBlobStoreIntegrationTest.java:502)
	at org.jclouds.blobstore.integration.internal.BaseContainerIntegrationTest.deleteContainerIfEmptyWithContents(BaseContainerIntegrationTest.java:449)
	at org.jclouds.filesystem.integration.FilesystemContainerIntegrationTest.deleteContainerIfEmptyWithContents(FilesystemContainerIntegrationTest.java:116)


Results :

Failed tests: 
  FilesystemContainerIntegrationTest.deleteContainerIfEmptyWithContents:116->BaseContainerIntegrationTest.deleteContainerIfEmptyWithContents:449->BaseBlobStoreIntegrationTest.recycleContainerAndAddToPool:502->BaseBlobStoreIntegrationTest.returnContainer:465
» Runtime

Tests run: 85, Failures: 1, Errors: 0, Skipped: 7

[INFO] ------------------------------------------------------------------------
[INFO] Reactor Summary:
[INFO] 
[INFO] Apache jclouds Project ............................ SUCCESS [14.022s]
[INFO] jclouds shared Maven resources .................... SUCCESS [4.213s]
[INFO] jclouds Components Core ........................... SUCCESS [1:32.097s]
[INFO] jclouds SLF4J Logging Module ...................... SUCCESS [2.513s]
[INFO] jclouds OAuth core ................................ SUCCESS [4.316s]
[INFO] jclouds Google Cloud Core ......................... SUCCESS [2.476s]
[INFO] jclouds OpenStack Components Core ................. SUCCESS [19.896s]
[INFO] jclouds commons project ........................... SUCCESS [0.791s]
[INFO] jclouds script builder ............................ SUCCESS [5.262s]
[INFO] jclouds compute core .............................. SUCCESS [53.386s]
[INFO] jclouds Log4J Logging Module ...................... SUCCESS [2.347s]
[INFO] jclouds loadbalancer core ......................... SUCCESS [2.061s]
[INFO] jclouds sts api ................................... SUCCESS [17.211s]
[INFO] jclouds cloudwatch api ............................ SUCCESS [11.160s]
[INFO] jclouds bouncycastle EncryptionService Module ..... SUCCESS [3.641s]
[INFO] jclouds sshj ssh client ........................... SUCCESS [4.802s]
[INFO] jclouds cloudstack core ........................... SUCCESS [46.726s]
[INFO] jclouds blobstore core ............................ SUCCESS [32.843s]
[INFO] jclouds filesystem core ........................... FAILURE [58.077s]
[INFO] jclouds bring your own node provider .............. SKIPPED
[INFO] jclouds OkHttp Driver ............................. SKIPPED
[INFO] jclouds s3 api .................................... SKIPPED
[INFO] jclouds ec2 api ................................... SKIPPED
[INFO] jclouds sqs api ................................... SKIPPED
[INFO] jclouds elasticstack core ......................... SKIPPED
[INFO] jclouds atmos components .......................... SKIPPED
[INFO] jclouds openstack-keystone api .................... SKIPPED
[INFO] jclouds openstack-cinder api ...................... SKIPPED
[INFO] Apache jclouds :: OpenStack :: Nova API ........... SKIPPED
[INFO] jclouds openstack-nova-ec2 api .................... SKIPPED
[INFO] jclouds openstack-swift api ....................... SKIPPED
[INFO] jclouds openstack-trove api ....................... SKIPPED
[INFO] jclouds rackspace cloudidentity api ............... SKIPPED
[INFO] jclouds Rackspace Cloud Load Balancers API ........ SKIPPED
[INFO] jclouds Rackspace Next Generation Cloud Block Storage US provider  SKIPPED
[INFO] jclouds Rackspace Next Generation Cloud Servers US provider  SKIPPED
[INFO] jclouds rackspace clouddns api .................... SKIPPED
[INFO] jclouds rackspace-cloudfiles api .................. SKIPPED
[INFO] jclouds route53 api ............................... SKIPPED
[INFO] jclouds Chef api .................................. SKIPPED
[INFO] jclouds apis project .............................. SKIPPED
[INFO] jclouds GoGrid provider ........................... SKIPPED
[INFO] jclouds Azure Storage provider .................... SKIPPED
[INFO] jclouds Apache Http Components Client ............. SKIPPED
[INFO] jclouds joda DateService Module ................... SKIPPED
[INFO] jclouds netty payload module ...................... SKIPPED
[INFO] jclouds enterprise Module ......................... SKIPPED
[INFO] jclouds Amazon Simple Storage Service (S3) provider  SKIPPED
[INFO] jclouds Amazon Elastic Load Balancer provider ..... SKIPPED
[INFO] jclouds Amazon EC2 provider ....................... SKIPPED
[INFO] jclouds Amazon Simple Queue Service provider ...... SKIPPED
[INFO] jclouds DigitalOcean v2 API Provider .............. SKIPPED
[INFO] jclouds ElasticHosts Peer1 London provider ........ SKIPPED
[INFO] jclouds ElasticHosts Peer1 San Antonio provider ... SKIPPED
[INFO] jclouds ElasticHosts BlueSquare London provider ... SKIPPED
[INFO] jclouds ElasticHosts Peer1 Toronto provider ....... SKIPPED
[INFO] jclouds ElasticHosts Peer1 Los Angeles provider ... SKIPPED
[INFO] jclouds ElasticHosts Amsterdam provider ........... SKIPPED
[INFO] jclouds ElasticHosts San Jose provider ............ SKIPPED
[INFO] jclouds ElasticHosts Hong Kong provider ........... SKIPPED
[INFO] jclouds ElasticHosts Sydney provider .............. SKIPPED
[INFO] jclouds ElasticHosts Miami provider ............... SKIPPED
[INFO] jclouds ElasticHosts Dallas provider .............. SKIPPED
[INFO] jclouds Open Hosting East1 provider ............... SKIPPED
[INFO] jclouds Serverlove Manchester provider ............ SKIPPED
[INFO] jclouds SkaliCloud Malaysia provider .............. SKIPPED
[INFO] jclouds Go2Cloud Johannesburg1 provider ........... SKIPPED
[INFO] jclouds Google Compute Engine provider ............ SKIPPED
[INFO] jclouds SoftLayer core ............................ SKIPPED
[INFO] jclouds Rackspace Cloud Files US provider ......... SKIPPED
[INFO] jclouds Rackspace Cloud Files UK provider ......... SKIPPED
[INFO] jclouds Rackspace Next Generation Cloud DNS US provider  SKIPPED
[INFO] jclouds Rackspace Next Generation Cloud DNS UK provider  SKIPPED
[INFO] jclouds Rackspace Cloud Databases US provider ..... SKIPPED
[INFO] jclouds Rackspace Cloud Databases UK provider ..... SKIPPED
[INFO] jclouds Rackspace Cloud Load Balancers US provider  SKIPPED
[INFO] jclouds Rackspace Cloud Load Balancers UK provider  SKIPPED
[INFO] jclouds Rackspace Next Generation Cloud Block Storage UK provider  SKIPPED
[INFO] jclouds Rackspace Next Generation Cloud Servers provider  SKIPPED
[INFO] jclouds GleSYS core ............................... SKIPPED
[INFO] jclouds Amazon Identity and Access Management (STS) provider  SKIPPED
[INFO] jclouds Amazon Route 53 provider .................. SKIPPED
[INFO] jclouds ultradns-ws provider ...................... SKIPPED
[INFO] jclouds dynect api ................................ SKIPPED
[INFO] jclouds providers project ......................... SKIPPED
[INFO] jclouds jsch ssh client ........................... SKIPPED
[INFO] jclouds example components for a standalone compute provider  SKIPPED
[INFO] jclouds skeletons project ......................... SKIPPED
[INFO] jclouds Google App Engine Components .............. SKIPPED
[INFO] jclouds drivers project ........................... SKIPPED
[INFO] allcompute ........................................ SKIPPED
[INFO] allblobstore ...................................... SKIPPED
[INFO] allloadbalancer ................................... SKIPPED
[INFO] all ............................................... SKIPPED
[INFO] Apache jclouds .................................... SKIPPED
[INFO] ------------------------------------------------------------------------
[INFO] BUILD FAILURE
[INFO] ------------------------------------------------------------------------
[INFO] Total time: 6:22.524s
[INFO] Finished at: Mon Feb 08 21:56:18 EST 2016
[INFO] Final Memory: 83M/291M
[INFO] ------------------------------------------------------------------------
[ERROR] Failed to execute goal org.apache.maven.plugins:maven-surefire-plugin:2.17:test (integration)
on project filesystem: There are test failures.
[ERROR] 
[ERROR] Please refer to <https://jclouds.ci.cloudbees.com/job/jclouds-guava-guice-compat/GUAVA_VERSION=18.0,GUICE_VERSION=4.0,jdk=OpenJDK%207%20(latest)/ws/apis/filesystem/target/surefire-reports>
for the individual test results.
[ERROR] -> [Help 1]
org.apache.maven.lifecycle.LifecycleExecutionException: Failed to execute goal org.apache.maven.plugins:maven-surefire-plugin:2.17:test
(integration) on project filesystem: There are test failures.

Please refer to <https://jclouds.ci.cloudbees.com/job/jclouds-guava-guice-compat/GUAVA_VERSION=18.0,GUICE_VERSION=4.0,jdk=OpenJDK%207%20(latest)/ws/apis/filesystem/target/surefire-reports>
for the individual test results.
	at org.apache.maven.lifecycle.internal.MojoExecutor.execute(MojoExecutor.java:213)
	at org.apache.maven.lifecycle.internal.MojoExecutor.execute(MojoExecutor.java:153)
	at org.apache.maven.lifecycle.internal.MojoExecutor.execute(MojoExecutor.java:145)
	at org.apache.maven.lifecycle.internal.LifecycleModuleBuilder.buildProject(LifecycleModuleBuilder.java:84)
	at org.apache.maven.lifecycle.internal.LifecycleModuleBuilder.buildProject(LifecycleModuleBuilder.java:59)
	at org.apache.maven.lifecycle.internal.LifecycleStarter.singleThreadedBuild(LifecycleStarter.java:183)
	at org.apache.maven.lifecycle.internal.LifecycleStarter.execute(LifecycleStarter.java:161)
	at org.apache.maven.DefaultMaven.doExecute(DefaultMaven.java:320)
	at org.apache.maven.DefaultMaven.execute(DefaultMaven.java:156)
	at org.apache.maven.cli.MavenCli.execute(MavenCli.java:537)
	at org.apache.maven.cli.MavenCli.doMain(MavenCli.java:196)
	at org.apache.maven.cli.MavenCli.main(MavenCli.java:141)
	at sun.reflect.NativeMethodAccessorImpl.invoke0(Native Method)
	at sun.reflect.NativeMethodAccessorImpl.invoke(NativeMethodAccessorImpl.java:57)
	at sun.reflect.DelegatingMethodAccessorImpl.invoke(DelegatingMethodAccessorImpl.java:43)
	at java.lang.reflect.Method.invoke(Method.java:606)
	at org.codehaus.plexus.classworlds.launcher.Launcher.launchEnhanced(Launcher.java:290)
	at org.codehaus.plexus.classworlds.launcher.Launcher.launch(Launcher.java:230)
	at org.codehaus.plexus.classworlds.launcher.Launcher.mainWithExitCode(Launcher.java:409)
	at org.codehaus.plexus.classworlds.launcher.Launcher.main(Launcher.java:352)
Caused by: org.apache.maven.plugin.MojoFailureException: There are test failures.

Please refer to <https://jclouds.ci.cloudbees.com/job/jclouds-guava-guice-compat/GUAVA_VERSION=18.0,GUICE_VERSION=4.0,jdk=OpenJDK%207%20(latest)/ws/apis/filesystem/target/surefire-reports>
for the individual test results.
	at org.apache.maven.plugin.surefire.SurefireHelper.reportExecution(SurefireHelper.java:82)
	at org.apache.maven.plugin.surefire.SurefirePlugin.handleSummary(SurefirePlugin.java:195)
	at org.apache.maven.plugin.surefire.AbstractSurefireMojo.executeAfterPreconditionsChecked(AbstractSurefireMojo.java:861)
	at org.apache.maven.plugin.surefire.AbstractSurefireMojo.execute(AbstractSurefireMojo.java:729)
	at org.apache.maven.plugin.DefaultBuildPluginManager.executeMojo(DefaultBuildPluginManager.java:101)
	at org.apache.maven.lifecycle.internal.MojoExecutor.execute(MojoExecutor.java:209)
	... 19 more
[ERROR] 
[ERROR] Re-run Maven using the -X switch to enable full debug logging.
[ERROR] 
[ERROR] For more information about the errors and possible solutions, please read the following
articles:
[ERROR] [Help 1] http://cwiki.apache.org/confluence/display/MAVEN/MojoFailureException
[ERROR] 
[ERROR] After correcting the problems, you can resume the build with the command
[ERROR]   mvn <goals> -rf :filesystem
Build step 'Invoke top-level Maven targets' marked build as failure

Mime
View raw message