jclouds-notifications mailing list archives

Site index · List index
Message view « Date » · « Thread »
Top « Date » · « Thread »
From jenkins-no-re...@cloudbees.com
Subject Build failed in Jenkins: jclouds-labs-openstack #972
Date Wed, 16 Dec 2015 19:27:14 GMT
See <https://jclouds.ci.cloudbees.com/job/jclouds-labs-openstack/972/>

------------------------------------------
[...truncated 3466 lines...]
[INFO] Exclude: **/*.DS_STORE
[INFO] Exclude: **/TAGS
[INFO] Exclude: **/.metadata/**
[INFO] Exclude: **/atlassian-ide-plugin.xml
[INFO] Exclude: **/.DS_Store
[INFO] Exclude: .mailmap
[INFO] Exclude: .git/**
[INFO] Exclude: **/.gitignore
[INFO] Exclude: **/.gitattributes
[INFO] Exclude: **/.java-version
[INFO] Exclude: **/modernizer_exclusions.txt
[INFO] Exclude: **/.factorypath
[INFO] Exclude: **/.apt_generated/**
[INFO] Exclude: .repository/**
[INFO] Exclude: gc.log
[INFO] 26 resources included (use -debug for more details)
Warning:  org.apache.xerces.jaxp.SAXParserImpl$JAXPSAXParser: Property 'http://www.oracle.com/xml/jaxp/properties/entityExpansionLimit'
is not recognized.
Compiler warnings:
  WARNING:  'org.apache.xerces.jaxp.SAXParserImpl: Property 'http://javax.xml.XMLConstants/property/accessExternalDTD'
is not recognized.'
Warning:  org.apache.xerces.parsers.SAXParser: Feature 'http://javax.xml.XMLConstants/feature/secure-processing'
is not recognized.
Warning:  org.apache.xerces.parsers.SAXParser: Property 'http://javax.xml.XMLConstants/property/accessExternalDTD'
is not recognized.
Warning:  org.apache.xerces.parsers.SAXParser: Property 'http://www.oracle.com/xml/jaxp/properties/entityExpansionLimit'
is not recognized.
[INFO] Rat check: Summary of files. Unapproved: 0 unknown: 0 generated: 0 approved: 26 licence.
[INFO] 
[INFO] --- maven-jar-plugin:2.4:test-jar (default) @ openstack-heat ---
[INFO] Building jar: <https://jclouds.ci.cloudbees.com/job/jclouds-labs-openstack/ws/openstack-heat/target/openstack-heat-2.0.0-SNAPSHOT-tests.jar>
[INFO] 
[INFO] --- maven-javadoc-plugin:2.9:jar (javadoc) @ openstack-heat ---
[INFO] 
15 warnings
[WARNING] Javadoc Warnings
[WARNING] <https://jclouds.ci.cloudbees.com/job/jclouds-labs-openstack/ws/openstack-heat/src/main/java/org/jclouds/openstack/heat/v1/domain/StackResourceStatus.java>:49:
warning - @param argument "name" is not a parameter name.
[WARNING] <https://jclouds.ci.cloudbees.com/job/jclouds-labs-openstack/ws/openstack-heat/src/main/java/org/jclouds/openstack/heat/v1/domain/StackStatus.java>:48:
warning - @param argument "name" is not a parameter name.
[WARNING] <https://jclouds.ci.cloudbees.com/job/jclouds-labs-openstack/ws/openstack-heat/src/main/java/org/jclouds/openstack/heat/v1/options/CreateStack.java>:51:
warning - Tag @see:illegal character: "60" in "Builder#parameters(Map<String, Object>)"
[WARNING] <https://jclouds.ci.cloudbees.com/job/jclouds-labs-openstack/ws/openstack-heat/src/main/java/org/jclouds/openstack/heat/v1/options/CreateStack.java>:51:
warning - Tag @see:illegal character: "62" in "Builder#parameters(Map<String, Object>)"
[WARNING] <https://jclouds.ci.cloudbees.com/job/jclouds-labs-openstack/ws/openstack-heat/src/main/java/org/jclouds/openstack/heat/v1/options/CreateStack.java>:51:
warning - Tag @see: can't find parameters(Map<String, Object>) in org.jclouds.openstack.heat.v1.options.CreateStack.Builder
[WARNING] <https://jclouds.ci.cloudbees.com/job/jclouds-labs-openstack/ws/openstack-heat/src/main/java/org/jclouds/openstack/heat/v1/options/CreateStack.java>:61:
warning - Tag @see:illegal character: "60" in "Builder#files(Map<String, String>)"
[WARNING] <https://jclouds.ci.cloudbees.com/job/jclouds-labs-openstack/ws/openstack-heat/src/main/java/org/jclouds/openstack/heat/v1/options/CreateStack.java>:61:
warning - Tag @see:illegal character: "62" in "Builder#files(Map<String, String>)"
[WARNING] <https://jclouds.ci.cloudbees.com/job/jclouds-labs-openstack/ws/openstack-heat/src/main/java/org/jclouds/openstack/heat/v1/options/CreateStack.java>:61:
warning - Tag @see: can't find files(Map<String, String>) in org.jclouds.openstack.heat.v1.options.CreateStack.Builder
[WARNING] <https://jclouds.ci.cloudbees.com/job/jclouds-labs-openstack/ws/openstack-heat/src/main/java/org/jclouds/openstack/heat/v1/options/ListStackOptions.java>:210:
warning - Tag @see: can't find status(String) in org.jclouds.openstack.heat.v1.options.ListStackOptions
[WARNING] <https://jclouds.ci.cloudbees.com/job/jclouds-labs-openstack/ws/openstack-heat/src/main/java/org/jclouds/openstack/heat/v1/options/ListStackOptions.java>:224:
warning - Tag @see: can't find sortKey(String) in org.jclouds.openstack.heat.v1.options.ListStackOptions
[WARNING] <https://jclouds.ci.cloudbees.com/job/jclouds-labs-openstack/ws/openstack-heat/src/main/java/org/jclouds/openstack/heat/v1/options/ListStackOptions.java>:231:
warning - Tag @see: can't find sortDirection(String) in org.jclouds.openstack.heat.v1.options.ListStackOptions
[WARNING] <https://jclouds.ci.cloudbees.com/job/jclouds-labs-openstack/ws/openstack-heat/src/main/java/org/jclouds/openstack/heat/v1/options/ListStackOptions.java>:238:
warning - Tag @see: malformed: "ListStackOptions#globalTenant(Boolean"
[WARNING] <https://jclouds.ci.cloudbees.com/job/jclouds-labs-openstack/ws/openstack-heat/src/main/java/org/jclouds/openstack/heat/v1/options/ListStackOptions.java>:238:
warning - Tag @see: reference not found: ListStackOptions#globalTenant(Boolean
[WARNING] <https://jclouds.ci.cloudbees.com/job/jclouds-labs-openstack/ws/openstack-heat/src/main/java/org/jclouds/openstack/heat/v1/options/ListStackOptions.java>:57:
warning - @param argument "name" is not a parameter name.
[WARNING] <https://jclouds.ci.cloudbees.com/job/jclouds-labs-openstack/ws/openstack-heat/src/main/java/org/jclouds/openstack/heat/v1/options/ListStackOptions.java>:98:
warning - @param argument "name" is not a parameter name.
[INFO] Building jar: <https://jclouds.ci.cloudbees.com/job/jclouds-labs-openstack/ws/openstack-heat/target/openstack-heat-2.0.0-SNAPSHOT-javadoc.jar>
[INFO] 
[INFO] --- maven-source-plugin:2.2:jar-no-fork (attach-sources) @ openstack-heat ---
[INFO] Building jar: <https://jclouds.ci.cloudbees.com/job/jclouds-labs-openstack/ws/openstack-heat/target/openstack-heat-2.0.0-SNAPSHOT-sources.jar>
[INFO] 
[INFO] --- maven-surefire-plugin:2.17:test (integration) @ openstack-heat ---
[JENKINS] Recording test results
[INFO] 
[INFO] --- duplicate-finder-maven-plugin:1.1.1:check (default) @ openstack-heat ---
[WARNING] <ignoreResources> has been deprecated and replaced with <ignoreResourcePatterns>.
It will go away in version 1.2.0. Please update your POM accordingly!
[INFO] Checking compile classpath
[INFO] Checking runtime classpath
[INFO] Checking test classpath
[INFO] 
[INFO] --- maven-checkstyle-plugin:2.15:check (default) @ openstack-heat ---
[INFO] 
[INFO] --- modernizer-maven-plugin:1.4.0:modernizer (modernizer) @ openstack-heat ---
[INFO] 
[INFO] --- maven-install-plugin:2.4:install (default-install) @ openstack-heat ---
[INFO] Installing <https://jclouds.ci.cloudbees.com/job/jclouds-labs-openstack/ws/openstack-heat/target/openstack-heat-2.0.0-SNAPSHOT.jar>
to <https://jclouds.ci.cloudbees.com/job/jclouds-labs-openstack/ws/.repository/org/apache/jclouds/labs/openstack-heat/2.0.0-SNAPSHOT/openstack-heat-2.0.0-SNAPSHOT.jar>
[INFO] Installing <https://jclouds.ci.cloudbees.com/job/jclouds-labs-openstack/ws/openstack-heat/pom.xml>
to <https://jclouds.ci.cloudbees.com/job/jclouds-labs-openstack/ws/.repository/org/apache/jclouds/labs/openstack-heat/2.0.0-SNAPSHOT/openstack-heat-2.0.0-SNAPSHOT.pom>
[INFO] Installing <https://jclouds.ci.cloudbees.com/job/jclouds-labs-openstack/ws/openstack-heat/target/openstack-heat-2.0.0-SNAPSHOT-tests.jar>
to <https://jclouds.ci.cloudbees.com/job/jclouds-labs-openstack/ws/.repository/org/apache/jclouds/labs/openstack-heat/2.0.0-SNAPSHOT/openstack-heat-2.0.0-SNAPSHOT-tests.jar>
[INFO] Installing <https://jclouds.ci.cloudbees.com/job/jclouds-labs-openstack/ws/openstack-heat/target/openstack-heat-2.0.0-SNAPSHOT-javadoc.jar>
to <https://jclouds.ci.cloudbees.com/job/jclouds-labs-openstack/ws/.repository/org/apache/jclouds/labs/openstack-heat/2.0.0-SNAPSHOT/openstack-heat-2.0.0-SNAPSHOT-javadoc.jar>
[INFO] Installing <https://jclouds.ci.cloudbees.com/job/jclouds-labs-openstack/ws/openstack-heat/target/openstack-heat-2.0.0-SNAPSHOT-sources.jar>
to <https://jclouds.ci.cloudbees.com/job/jclouds-labs-openstack/ws/.repository/org/apache/jclouds/labs/openstack-heat/2.0.0-SNAPSHOT/openstack-heat-2.0.0-SNAPSHOT-sources.jar>
[INFO] 
[INFO] --- maven-bundle-plugin:2.3.7:install (default-install) @ openstack-heat ---
[INFO] Local OBR update disabled (enable with -DobrRepository)
[INFO] 
[INFO] --- maven-deploy-plugin:2.7:deploy (default-deploy) @ openstack-heat ---
Downloading: https://repository.apache.org/content/repositories/snapshots/org/apache/jclouds/labs/openstack-heat/2.0.0-SNAPSHOT/maven-metadata.xml
Downloaded: https://repository.apache.org/content/repositories/snapshots/org/apache/jclouds/labs/openstack-heat/2.0.0-SNAPSHOT/maven-metadata.xml
(2 KB at 1.6 KB/sec)
Uploading: https://repository.apache.org/content/repositories/snapshots/org/apache/jclouds/labs/openstack-heat/2.0.0-SNAPSHOT/openstack-heat-2.0.0-20151216.192656-482.jar
Uploaded: https://repository.apache.org/content/repositories/snapshots/org/apache/jclouds/labs/openstack-heat/2.0.0-SNAPSHOT/openstack-heat-2.0.0-20151216.192656-482.jar
(48 KB at 45.0 KB/sec)
Uploading: https://repository.apache.org/content/repositories/snapshots/org/apache/jclouds/labs/openstack-heat/2.0.0-SNAPSHOT/openstack-heat-2.0.0-20151216.192656-482.pom
Uploaded: https://repository.apache.org/content/repositories/snapshots/org/apache/jclouds/labs/openstack-heat/2.0.0-SNAPSHOT/openstack-heat-2.0.0-20151216.192656-482.pom
(6 KB at 4.6 KB/sec)
Downloading: https://repository.apache.org/content/repositories/snapshots/org/apache/jclouds/labs/openstack-heat/maven-metadata.xml
Downloaded: https://repository.apache.org/content/repositories/snapshots/org/apache/jclouds/labs/openstack-heat/maven-metadata.xml
(437 B at 0.6 KB/sec)
Uploading: https://repository.apache.org/content/repositories/snapshots/org/apache/jclouds/labs/openstack-heat/2.0.0-SNAPSHOT/maven-metadata.xml
Uploaded: https://repository.apache.org/content/repositories/snapshots/org/apache/jclouds/labs/openstack-heat/2.0.0-SNAPSHOT/maven-metadata.xml
(2 KB at 1.4 KB/sec)
Uploading: https://repository.apache.org/content/repositories/snapshots/org/apache/jclouds/labs/openstack-heat/maven-metadata.xml
Uploaded: https://repository.apache.org/content/repositories/snapshots/org/apache/jclouds/labs/openstack-heat/maven-metadata.xml
(437 B at 0.5 KB/sec)
Uploading: https://repository.apache.org/content/repositories/snapshots/org/apache/jclouds/labs/openstack-heat/2.0.0-SNAPSHOT/openstack-heat-2.0.0-20151216.192656-482-tests.jar
Uploaded: https://repository.apache.org/content/repositories/snapshots/org/apache/jclouds/labs/openstack-heat/2.0.0-SNAPSHOT/openstack-heat-2.0.0-20151216.192656-482-tests.jar
(42 KB at 38.9 KB/sec)
Uploading: https://repository.apache.org/content/repositories/snapshots/org/apache/jclouds/labs/openstack-heat/2.0.0-SNAPSHOT/maven-metadata.xml
Uploaded: https://repository.apache.org/content/repositories/snapshots/org/apache/jclouds/labs/openstack-heat/2.0.0-SNAPSHOT/maven-metadata.xml
(2 KB at 1.5 KB/sec)
Uploading: https://repository.apache.org/content/repositories/snapshots/org/apache/jclouds/labs/openstack-heat/2.0.0-SNAPSHOT/openstack-heat-2.0.0-20151216.192656-482-javadoc.jar
Uploaded: https://repository.apache.org/content/repositories/snapshots/org/apache/jclouds/labs/openstack-heat/2.0.0-SNAPSHOT/openstack-heat-2.0.0-20151216.192656-482-javadoc.jar
(191 KB at 153.4 KB/sec)
Uploading: https://repository.apache.org/content/repositories/snapshots/org/apache/jclouds/labs/openstack-heat/2.0.0-SNAPSHOT/maven-metadata.xml
Uploaded: https://repository.apache.org/content/repositories/snapshots/org/apache/jclouds/labs/openstack-heat/2.0.0-SNAPSHOT/maven-metadata.xml
(2 KB at 1.5 KB/sec)
Uploading: https://repository.apache.org/content/repositories/snapshots/org/apache/jclouds/labs/openstack-heat/2.0.0-SNAPSHOT/openstack-heat-2.0.0-20151216.192656-482-sources.jar
Uploaded: https://repository.apache.org/content/repositories/snapshots/org/apache/jclouds/labs/openstack-heat/2.0.0-SNAPSHOT/openstack-heat-2.0.0-20151216.192656-482-sources.jar
(26 KB at 26.1 KB/sec)
Uploading: https://repository.apache.org/content/repositories/snapshots/org/apache/jclouds/labs/openstack-heat/2.0.0-SNAPSHOT/maven-metadata.xml
Uploaded: https://repository.apache.org/content/repositories/snapshots/org/apache/jclouds/labs/openstack-heat/2.0.0-SNAPSHOT/maven-metadata.xml
(2 KB at 1.6 KB/sec)
[INFO] 
[INFO] --- maven-bundle-plugin:2.3.7:deploy (default-deploy) @ openstack-heat ---
[INFO] Remote OBR update disabled (enable with -DremoteOBR)
Started calculate disk usage of build
Finished Calculation of disk usage of build in 0 seconds
Started calculate disk usage of workspace
Finished Calculation of disk usage of workspace in 0 seconds
[INFO]                                                                         
[INFO] ------------------------------------------------------------------------
[INFO] Building jclouds openstack-neutron api 2.0.0-SNAPSHOT
[INFO] ------------------------------------------------------------------------
[INFO] 
[INFO] --- maven-clean-plugin:2.5:clean (default-clean) @ openstack-neutron ---
[INFO] 
[INFO] --- maven-enforcer-plugin:1.1.1:enforce (enforce-banned-dependencies) @ openstack-neutron
---
[INFO] 
[INFO] --- maven-enforcer-plugin:1.1.1:enforce (enforce-java) @ openstack-neutron ---
[INFO] 
[INFO] --- maven-remote-resources-plugin:1.5:process (default) @ openstack-neutron ---
[INFO] 
[INFO] --- maven-resources-plugin:2.6:resources (default-resources) @ openstack-neutron ---
[INFO] Using 'UTF-8' encoding to copy filtered resources.
[INFO] skip non existing resourceDirectory <https://jclouds.ci.cloudbees.com/job/jclouds-labs-openstack/ws/openstack-neutron/src/main/clojure>
[INFO] skip non existing resourceDirectory <https://jclouds.ci.cloudbees.com/job/jclouds-labs-openstack/ws/openstack-neutron/src/main/resources>
[INFO] skip non existing resourceDirectory <https://jclouds.ci.cloudbees.com/job/jclouds-labs-openstack/ws/openstack-neutron/target/classes>
[INFO] Copying 3 resources
[INFO] 
[INFO] --- maven-compiler-plugin:3.1:compile (default-compile) @ openstack-neutron ---
[INFO] Changes detected - recompiling the module!
[INFO] Compiling 112 source files to <https://jclouds.ci.cloudbees.com/job/jclouds-labs-openstack/ws/openstack-neutron/target/classes>
<https://jclouds.ci.cloudbees.com/job/jclouds-labs-openstack/ws/openstack-neutron/src/main/java/org/jclouds/openstack/neutron/v2/config/NeutronHttpApiModule.java>:19:
error: cannot find symbol
import static org.jclouds.openstack.keystone.v2_0.config.KeystoneHttpApiModule.aliasBinder;
^
  symbol:   static aliasBinder
  location: class
1 error
Started calculate disk usage of build
Finished Calculation of disk usage of build in 0 seconds
Started calculate disk usage of workspace
Finished Calculation of disk usage of workspace in 0 seconds
[INFO] ------------------------------------------------------------------------
[INFO] Reactor Summary:
[INFO] 
[INFO] jclouds openstack-glance api ...................... SUCCESS [1:02.592s]
[INFO] Apache jclouds :: OpenStack :: Heat API ........... SUCCESS [33.772s]
[INFO] jclouds openstack-neutron api ..................... FAILURE [1.342s]
[INFO] Apache jclouds :: OpenStack :: Poppy API .......... SKIPPED
[INFO] jclouds openstack-marconi api ..................... SKIPPED
[INFO] jclouds Rackspace Auto Scale API .................. SKIPPED
[INFO] jclouds Rackspace Auto Scale UK Provider .......... SKIPPED
[INFO] jclouds Rackspace Auto Scale US Provider .......... SKIPPED
[INFO] jclouds Rackspace Cloud Queues US provider ........ SKIPPED
[INFO] jclouds Rackspace Cloud Queues UK provider ........ SKIPPED
[INFO] jclouds rackspace-cloudbigdata api ................ SKIPPED
[INFO] jclouds rackspace-cloudbigdata api provider ....... SKIPPED
[INFO] jclouds Rackspace Cloud Networks UK provider ...... SKIPPED
[INFO] jclouds Rackspace Cloud Networks US provider ...... SKIPPED
[INFO] jclouds Rackspace CDN UK provider ................. SKIPPED
[INFO] jclouds Rackspace CDN US provider ................. SKIPPED
[INFO] jclouds Rackspace Orchestration US provider ....... SKIPPED
[INFO] jclouds Rackspace Orchestration UK provider ....... SKIPPED
[INFO] Apache jclouds labs openstack ..................... SKIPPED
[INFO] ------------------------------------------------------------------------
[INFO] BUILD FAILURE
[INFO] ------------------------------------------------------------------------
[INFO] Total time: 1:44.677s
[INFO] Finished at: Wed Dec 16 14:27:09 EST 2015
[INFO] Final Memory: 48M/256M
[INFO] ------------------------------------------------------------------------
Waiting for Jenkins to finish collecting data
[ERROR] Failed to execute goal org.apache.maven.plugins:maven-compiler-plugin:3.1:compile
(default-compile) on project openstack-neutron: Compilation failure -> [Help 1]
org.apache.maven.lifecycle.LifecycleExecutionException: Failed to execute goal org.apache.maven.plugins:maven-compiler-plugin:3.1:compile
(default-compile) on project openstack-neutron: Compilation failure
	at org.apache.maven.lifecycle.internal.MojoExecutor.execute(MojoExecutor.java:213)
	at org.apache.maven.lifecycle.internal.MojoExecutor.execute(MojoExecutor.java:153)
	at org.apache.maven.lifecycle.internal.MojoExecutor.execute(MojoExecutor.java:145)
	at org.apache.maven.lifecycle.internal.LifecycleModuleBuilder.buildProject(LifecycleModuleBuilder.java:84)
	at org.apache.maven.lifecycle.internal.LifecycleModuleBuilder.buildProject(LifecycleModuleBuilder.java:59)
	at org.apache.maven.lifecycle.internal.LifecycleStarter.singleThreadedBuild(LifecycleStarter.java:183)
	at org.apache.maven.lifecycle.internal.LifecycleStarter.execute(LifecycleStarter.java:161)
	at org.apache.maven.DefaultMaven.doExecute(DefaultMaven.java:320)
	at org.apache.maven.DefaultMaven.execute(DefaultMaven.java:156)
	at org.jvnet.hudson.maven3.launcher.Maven3Launcher.main(Maven3Launcher.java:117)
	at sun.reflect.NativeMethodAccessorImpl.invoke0(Native Method)
	at sun.reflect.NativeMethodAccessorImpl.invoke(NativeMethodAccessorImpl.java:57)
	at sun.reflect.DelegatingMethodAccessorImpl.invoke(DelegatingMethodAccessorImpl.java:43)
	at java.lang.reflect.Method.invoke(Method.java:606)
	at org.codehaus.plexus.classworlds.launcher.Launcher.launchStandard(Launcher.java:329)
	at org.codehaus.plexus.classworlds.launcher.Launcher.launch(Launcher.java:239)
	at org.jvnet.hudson.maven3.agent.Maven3Main.launch(Maven3Main.java:178)
	at sun.reflect.NativeMethodAccessorImpl.invoke0(Native Method)
	at sun.reflect.NativeMethodAccessorImpl.invoke(NativeMethodAccessorImpl.java:57)
	at sun.reflect.DelegatingMethodAccessorImpl.invoke(DelegatingMethodAccessorImpl.java:43)
	at java.lang.reflect.Method.invoke(Method.java:606)
	at hudson.maven.Maven3Builder.call(Maven3Builder.java:136)
	at hudson.maven.Maven3Builder.call(Maven3Builder.java:71)
	at hudson.remoting.UserRequest.perform(UserRequest.java:120)
	at hudson.remoting.UserRequest.perform(UserRequest.java:48)
	at hudson.remoting.Request$2.run(Request.java:326)
	at hudson.remoting.InterceptingExecutorService$1.call(InterceptingExecutorService.java:68)
	at java.util.concurrent.FutureTask.run(FutureTask.java:262)
	at java.util.concurrent.ThreadPoolExecutor.runWorker(ThreadPoolExecutor.java:1145)
	at java.util.concurrent.ThreadPoolExecutor$Worker.run(ThreadPoolExecutor.java:615)
	at java.lang.Thread.run(Thread.java:745)
Caused by: org.apache.maven.plugin.compiler.CompilationFailureException: Compilation failure
	at org.apache.maven.plugin.compiler.AbstractCompilerMojo.execute(AbstractCompilerMojo.java:862)
	at org.apache.maven.plugin.compiler.CompilerMojo.execute(CompilerMojo.java:129)
	at org.apache.maven.plugin.DefaultBuildPluginManager.executeMojo(DefaultBuildPluginManager.java:101)
	at org.apache.maven.lifecycle.internal.MojoExecutor.execute(MojoExecutor.java:209)
	... 30 more
[ERROR] 
[ERROR] Re-run Maven using the -X switch to enable full debug logging.
[ERROR] 
[ERROR] For more information about the errors and possible solutions, please read the following
articles:
[ERROR] [Help 1] http://cwiki.apache.org/confluence/display/MAVEN/MojoFailureException
[ERROR] 
[ERROR] After correcting the problems, you can resume the build with the command
[ERROR]   mvn <goals> -rf :openstack-neutron
[JENKINS] Archiving <https://jclouds.ci.cloudbees.com/job/jclouds-labs-openstack/ws/rackspace-autoscale-us/pom.xml>
to org.apache.jclouds.labs/rackspace-autoscale-us/2.0.0-SNAPSHOT/rackspace-autoscale-us-2.0.0-SNAPSHOT.pom
[JENKINS] Archiving <https://jclouds.ci.cloudbees.com/job/jclouds-labs-openstack/ws/rackspace-autoscale/pom.xml>
to org.apache.jclouds.labs/rackspace-autoscale/2.0.0-SNAPSHOT/rackspace-autoscale-2.0.0-SNAPSHOT.pom
[JENKINS] Archiving <https://jclouds.ci.cloudbees.com/job/jclouds-labs-openstack/ws/rackspace-cdn-uk/pom.xml>
to org.apache.jclouds.labs/rackspace-cdn-uk/2.0.0-SNAPSHOT/rackspace-cdn-uk-2.0.0-SNAPSHOT.pom
[JENKINS] Archiving <https://jclouds.ci.cloudbees.com/job/jclouds-labs-openstack/ws/rackspace-cloudbigdata-us/pom.xml>
to org.apache.jclouds.labs/rackspace-cloudbigdata-us/2.0.0-SNAPSHOT/rackspace-cloudbigdata-us-2.0.0-SNAPSHOT.pom
[JENKINS] Archiving <https://jclouds.ci.cloudbees.com/job/jclouds-labs-openstack/ws/rackspace-autoscale-uk/pom.xml>
to org.apache.jclouds.labs/rackspace-autoscale-uk/2.0.0-SNAPSHOT/rackspace-autoscale-uk-2.0.0-SNAPSHOT.pom
[JENKINS] Archiving <https://jclouds.ci.cloudbees.com/job/jclouds-labs-openstack/ws/rackspace-cloudqueues-us/pom.xml>
to org.apache.jclouds.labs/rackspace-cloudqueues-us/2.0.0-SNAPSHOT/rackspace-cloudqueues-us-2.0.0-SNAPSHOT.pom
[JENKINS] Archiving <https://jclouds.ci.cloudbees.com/job/jclouds-labs-openstack/ws/rackspace-cloudbigdata/pom.xml>
to org.apache.jclouds.labs/rackspace-cloudbigdata/2.0.0-SNAPSHOT/rackspace-cloudbigdata-2.0.0-SNAPSHOT.pom
[JENKINS] Archiving <https://jclouds.ci.cloudbees.com/job/jclouds-labs-openstack/ws/rackspace-orchestration-us/pom.xml>
to org.apache.jclouds.labs/rackspace-orchestration-us/2.0.0-SNAPSHOT/rackspace-orchestration-us-2.0.0-SNAPSHOT.pom
[JENKINS] Archiving <https://jclouds.ci.cloudbees.com/job/jclouds-labs-openstack/ws/rackspace-cdn-us/pom.xml>
to org.apache.jclouds.labs/rackspace-cdn-us/2.0.0-SNAPSHOT/rackspace-cdn-us-2.0.0-SNAPSHOT.pom
[JENKINS] Archiving <https://jclouds.ci.cloudbees.com/job/jclouds-labs-openstack/ws/openstack-heat/pom.xml>
to org.apache.jclouds.labs/openstack-heat/2.0.0-SNAPSHOT/openstack-heat-2.0.0-SNAPSHOT.pom
[JENKINS] Archiving <https://jclouds.ci.cloudbees.com/job/jclouds-labs-openstack/ws/openstack-heat/target/openstack-heat-2.0.0-SNAPSHOT.jar>
to org.apache.jclouds.labs/openstack-heat/2.0.0-20151216.192656-482/openstack-heat-2.0.0-20151216.192656-482.jar
[JENKINS] Archiving <https://jclouds.ci.cloudbees.com/job/jclouds-labs-openstack/ws/openstack-heat/target/openstack-heat-2.0.0-SNAPSHOT-tests.jar>
to org.apache.jclouds.labs/openstack-heat/2.0.0-20151216.192656-482/openstack-heat-2.0.0-20151216.192656-482-tests.jar
[JENKINS] Archiving <https://jclouds.ci.cloudbees.com/job/jclouds-labs-openstack/ws/openstack-heat/target/openstack-heat-2.0.0-SNAPSHOT-javadoc.jar>
to org.apache.jclouds.labs/openstack-heat/2.0.0-20151216.192656-482/openstack-heat-2.0.0-20151216.192656-482-javadoc.jar
[JENKINS] Archiving <https://jclouds.ci.cloudbees.com/job/jclouds-labs-openstack/ws/openstack-heat/target/openstack-heat-2.0.0-SNAPSHOT-sources.jar>
to org.apache.jclouds.labs/openstack-heat/2.0.0-20151216.192656-482/openstack-heat-2.0.0-20151216.192656-482-sources.jar
[JENKINS] Archiving <https://jclouds.ci.cloudbees.com/job/jclouds-labs-openstack/ws/openstack-neutron/pom.xml>
to org.apache.jclouds.labs/openstack-neutron/2.0.0-SNAPSHOT/openstack-neutron-2.0.0-SNAPSHOT.pom
[JENKINS] Archiving <https://jclouds.ci.cloudbees.com/job/jclouds-labs-openstack/ws/openstack-poppy/pom.xml>
to org.apache.jclouds.labs/openstack-poppy/2.0.0-SNAPSHOT/openstack-poppy-2.0.0-SNAPSHOT.pom
[JENKINS] Archiving <https://jclouds.ci.cloudbees.com/job/jclouds-labs-openstack/ws/rackspace-cloudqueues-uk/pom.xml>
to org.apache.jclouds.labs/rackspace-cloudqueues-uk/2.0.0-SNAPSHOT/rackspace-cloudqueues-uk-2.0.0-SNAPSHOT.pom
[JENKINS] Archiving <https://jclouds.ci.cloudbees.com/job/jclouds-labs-openstack/ws/rackspace-orchestration-uk/pom.xml>
to org.apache.jclouds.labs/rackspace-orchestration-uk/2.0.0-SNAPSHOT/rackspace-orchestration-uk-2.0.0-SNAPSHOT.pom
[JENKINS] Archiving <https://jclouds.ci.cloudbees.com/job/jclouds-labs-openstack/ws/rackspace-cloudnetworks-uk/pom.xml>
to org.apache.jclouds.labs/rackspace-cloudnetworks-uk/2.0.0-SNAPSHOT/rackspace-cloudnetworks-uk-2.0.0-SNAPSHOT.pom
[JENKINS] Archiving <https://jclouds.ci.cloudbees.com/job/jclouds-labs-openstack/ws/pom.xml>
to org.apache.jclouds.labs/jclouds-labs-openstack/2.0.0-SNAPSHOT/jclouds-labs-openstack-2.0.0-SNAPSHOT.pom
[JENKINS] Archiving <https://jclouds.ci.cloudbees.com/job/jclouds-labs-openstack/ws/openstack-marconi/pom.xml>
to org.apache.jclouds.labs/openstack-marconi/2.0.0-SNAPSHOT/openstack-marconi-2.0.0-SNAPSHOT.pom
[JENKINS] Archiving <https://jclouds.ci.cloudbees.com/job/jclouds-labs-openstack/ws/openstack-glance/pom.xml>
to org.apache.jclouds.labs/openstack-glance/2.0.0-SNAPSHOT/openstack-glance-2.0.0-SNAPSHOT.pom
[JENKINS] Archiving <https://jclouds.ci.cloudbees.com/job/jclouds-labs-openstack/ws/openstack-glance/target/openstack-glance-2.0.0-SNAPSHOT.jar>
to org.apache.jclouds.labs/openstack-glance/2.0.0-20151216.192621-528/openstack-glance-2.0.0-20151216.192621-528.jar
[JENKINS] Archiving <https://jclouds.ci.cloudbees.com/job/jclouds-labs-openstack/ws/openstack-glance/target/openstack-glance-2.0.0-SNAPSHOT-tests.jar>
to org.apache.jclouds.labs/openstack-glance/2.0.0-20151216.192621-528/openstack-glance-2.0.0-20151216.192621-528-tests.jar
[JENKINS] Archiving <https://jclouds.ci.cloudbees.com/job/jclouds-labs-openstack/ws/openstack-glance/target/openstack-glance-2.0.0-SNAPSHOT-javadoc.jar>
to org.apache.jclouds.labs/openstack-glance/2.0.0-20151216.192621-528/openstack-glance-2.0.0-20151216.192621-528-javadoc.jar
[JENKINS] Archiving <https://jclouds.ci.cloudbees.com/job/jclouds-labs-openstack/ws/openstack-glance/target/openstack-glance-2.0.0-SNAPSHOT-sources.jar>
to org.apache.jclouds.labs/openstack-glance/2.0.0-20151216.192621-528/openstack-glance-2.0.0-20151216.192621-528-sources.jar
[JENKINS] Archiving <https://jclouds.ci.cloudbees.com/job/jclouds-labs-openstack/ws/rackspace-cloudnetworks-us/pom.xml>
to org.apache.jclouds.labs/rackspace-cloudnetworks-us/2.0.0-SNAPSHOT/rackspace-cloudnetworks-us-2.0.0-SNAPSHOT.pom
Sending e-mails to: notifications@jclouds.apache.org
channel stopped
Started calculate disk usage of build
Finished Calculation of disk usage of build in 0 seconds
Started calculate disk usage of workspace
Finished Calculation of disk usage of workspace in 0 seconds

Mime
View raw message