james-server-dev mailing list archives

Site index · List index
Message view « Date » · « Thread »
Top « Date » · « Thread »
From Apache Hudson Server <hud...@hudson.apache.org>
Subject Build failed in Jenkins: mailbox-integration-tests #257
Date Tue, 12 Apr 2011 01:36:18 GMT
See <https://hudson.apache.org/hudson/job/mailbox-integration-tests/257/>

------------------------------------------
[...truncated 339 lines...]
Location: /org/apache/james/imap/scripts/UidSearchAtoms.test:2073
LastClientMsg: A142 UID SEARCH *:10
Expected: '\* SEARCH 21 22 23 24 25 26 27 28 29 30'
Actual   : '* SEARCH 30 31 32 33 34 35 36 37 38 39'
Location: /org/apache/james/imap/scripts/UidSearchAtoms.test:2073
LastClientMsg: A142 UID SEARCH *:10
Expected: '\* SEARCH 21 22 23 24 25 26 27 28 29 30'
Actual   : '* SEARCH 30 31 32 33 34 35 36 37 38 39'
Location: /org/apache/james/imap/scripts/UidSearchAtoms.test:2073
LastClientMsg: A142 UID SEARCH *:10
Expected: '\* SEARCH 21 22 23 24 25 26 27 28 29 30'
Actual   : '* SEARCH 30 31 32 33 34 35 36 37 38 39'
Running org.apache.james.mailbox.maildir.imap.SecurityTest
Tests run: 21, Failures: 0, Errors: 0, Skipped: 0, Time elapsed: 0.328 sec
Running org.apache.james.mailbox.maildir.imap.RenameTest
Tests run: 9, Failures: 0, Errors: 0, Skipped: 0, Time elapsed: 1.867 sec
Running org.apache.james.mailbox.maildir.imap.FetchBodySectionTest
Tests run: 9, Failures: 0, Errors: 0, Skipped: 0, Time elapsed: 1.095 sec
Running org.apache.james.mailbox.maildir.imap.AuthenticatedStateTest
Tests run: 57, Failures: 0, Errors: 0, Skipped: 0, Time elapsed: 1.302 sec
Running org.apache.james.mailbox.maildir.imap.SelectedStateTest
Tests run: 30, Failures: 0, Errors: 0, Skipped: 0, Time elapsed: 1.572 sec
Running org.apache.james.mailbox.maildir.imap.ConcurrentSessionsTest
Tests run: 21, Failures: 0, Errors: 0, Skipped: 0, Time elapsed: 1.172 sec
Running org.apache.james.mailbox.maildir.imap.ExpungeTest
Tests run: 3, Failures: 0, Errors: 0, Skipped: 0, Time elapsed: 0.835 sec
Running org.apache.james.mailbox.maildir.imap.SelectedInboxTest
Tests run: 42, Failures: 0, Errors: 0, Skipped: 0, Time elapsed: 1.193 sec
Running org.apache.james.mailbox.maildir.imap.SelectTest
Tests run: 3, Failures: 0, Errors: 0, Skipped: 0, Time elapsed: 0.693 sec
Running org.apache.james.mailbox.maildir.imap.NonAuthenticatedStateTest
Tests run: 21, Failures: 0, Errors: 0, Skipped: 0, Time elapsed: 0.384 sec
Running org.apache.james.mailbox.maildir.imap.FetchTest
Tests run: 24, Failures: 0, Errors: 0, Skipped: 0, Time elapsed: 1.543 sec
Running org.apache.james.mailbox.maildir.imap.FetchBodyStructureTest
Tests run: 12, Failures: 0, Errors: 9, Skipped: 0, Time elapsed: 1.521 sec <<< FAILURE!
Location: /org/apache/james/imap/scripts/FetchSimpleBodyStructure.test:135
LastClientMsg: A14 FETCH 1 (BODY[3.HEADER])
Expected: '\* 1 FETCH \(BODY\[3\.HEADER\] \{0\}'
Actual   : '* 1 FETCH (BODY[3.HEADER] {2}'
Location: /org/apache/james/imap/scripts/FetchSimpleBodyStructure.test:135
LastClientMsg: A14 FETCH 1 (BODY[3.HEADER])
Expected: '\* 1 FETCH \(BODY\[3\.HEADER\] \{0\}'
Actual   : '* 1 FETCH (BODY[3.HEADER] {2}'
Location: /org/apache/james/imap/scripts/FetchSimpleBodyStructure.test:135
LastClientMsg: A14 FETCH 1 (BODY[3.HEADER])
Expected: '\* 1 FETCH \(BODY\[3\.HEADER\] \{0\}'
Actual   : '* 1 FETCH (BODY[3.HEADER] {2}'
Location: /org/apache/james/imap/scripts/FetchMultipartBodyStructure.test:585
LastClientMsg: A13 FETCH 1 (BODY[3.HEADER])
Expected: '\* 1 FETCH \(BODY\[3\.HEADER\] \{0\}'
Actual   : '* 1 FETCH (BODY[3.HEADER] {2}'
Location: /org/apache/james/imap/scripts/FetchMultipartBodyStructure.test:585
LastClientMsg: A13 FETCH 1 (BODY[3.HEADER])
Expected: '\* 1 FETCH \(BODY\[3\.HEADER\] \{0\}'
Actual   : '* 1 FETCH (BODY[3.HEADER] {2}'
Location: /org/apache/james/imap/scripts/FetchMultipartBodyStructure.test:585
LastClientMsg: A13 FETCH 1 (BODY[3.HEADER])
Expected: '\* 1 FETCH \(BODY\[3\.HEADER\] \{0\}'
Actual   : '* 1 FETCH (BODY[3.HEADER] {2}'
Location: /org/apache/james/imap/scripts/FetchStructureComplex.test:1420
LastClientMsg: A17 FETCH 1 (BODY[3.HEADER])
Expected: '\* 1 FETCH \(BODY\[3\.HEADER\] \{0\}'
Actual   : '* 1 FETCH (BODY[3.HEADER] {2}'
Location: /org/apache/james/imap/scripts/FetchStructureComplex.test:1420
LastClientMsg: A17 FETCH 1 (BODY[3.HEADER])
Expected: '\* 1 FETCH \(BODY\[3\.HEADER\] \{0\}'
Actual   : '* 1 FETCH (BODY[3.HEADER] {2}'
Location: /org/apache/james/imap/scripts/FetchStructureComplex.test:1420
LastClientMsg: A17 FETCH 1 (BODY[3.HEADER])
Expected: '\* 1 FETCH \(BODY\[3\.HEADER\] \{0\}'
Actual   : '* 1 FETCH (BODY[3.HEADER] {2}'
Running org.apache.james.mailbox.maildir.imap.FetchHeadersTest
Tests run: 6, Failures: 0, Errors: 0, Skipped: 0, Time elapsed: 1.109 sec
Running org.apache.james.mailbox.maildir.imap.EventTest
Tests run: 3, Failures: 0, Errors: 0, Skipped: 0, Time elapsed: 0.715 sec
Running org.apache.james.mailbox.maildir.imap.PartialFetchTest
Tests run: 12, Failures: 0, Errors: 0, Skipped: 0, Time elapsed: 1.375 sec
Running org.apache.james.mailbox.inmemory.imap.SearchTest
Tests run: 6, Failures: 0, Errors: 3, Skipped: 0, Time elapsed: 1.306 sec <<< FAILURE!
Location: /org/apache/james/imap/scripts/SearchAtoms.test:1711
LastClientMsg: A82 SEARCH *:10
Expected: '\* SEARCH 1 2 3 4 5 6 7 8 9 10'
Actual   : '* SEARCH 10 11 12 13 14 15 16 17 18 19'
Location: /org/apache/james/imap/scripts/SearchAtoms.test:1711
LastClientMsg: A82 SEARCH *:10
Expected: '\* SEARCH 1 2 3 4 5 6 7 8 9 10'
Actual   : '* SEARCH 10 11 12 13 14 15 16 17 18 19'
Location: /org/apache/james/imap/scripts/SearchAtoms.test:1711
LastClientMsg: A82 SEARCH *:10
Expected: '\* SEARCH 1 2 3 4 5 6 7 8 9 10'
Actual   : '* SEARCH 10 11 12 13 14 15 16 17 18 19'
Running org.apache.james.mailbox.inmemory.imap.ListingTest
Tests run: 6, Failures: 0, Errors: 0, Skipped: 0, Time elapsed: 0.373 sec
Running org.apache.james.mailbox.inmemory.imap.UidSearchTest
Tests run: 6, Failures: 0, Errors: 3, Skipped: 0, Time elapsed: 1.473 sec <<< FAILURE!
Location: /org/apache/james/imap/scripts/UidSearchAtoms.test:2073
LastClientMsg: A142 UID SEARCH *:10
Expected: '\* SEARCH 21 22 23 24 25 26 27 28 29 30'
Actual   : '* SEARCH 30 31 32 33 34 35 36 37 38 39'
Location: /org/apache/james/imap/scripts/UidSearchAtoms.test:2073
LastClientMsg: A142 UID SEARCH *:10
Expected: '\* SEARCH 21 22 23 24 25 26 27 28 29 30'
Actual   : '* SEARCH 30 31 32 33 34 35 36 37 38 39'
Location: /org/apache/james/imap/scripts/UidSearchAtoms.test:2073
LastClientMsg: A142 UID SEARCH *:10
Expected: '\* SEARCH 21 22 23 24 25 26 27 28 29 30'
Actual   : '* SEARCH 30 31 32 33 34 35 36 37 38 39'
Running org.apache.james.mailbox.inmemory.imap.SecurityTest
Tests run: 21, Failures: 0, Errors: 0, Skipped: 0, Time elapsed: 0.324 sec
Running org.apache.james.mailbox.inmemory.imap.RenameTest
Tests run: 9, Failures: 0, Errors: 0, Skipped: 0, Time elapsed: 1.146 sec
Running org.apache.james.mailbox.inmemory.imap.FetchBodySectionTest
Tests run: 9, Failures: 0, Errors: 0, Skipped: 0, Time elapsed: 0.888 sec
Running org.apache.james.mailbox.inmemory.imap.AuthenticatedStateTest
Tests run: 57, Failures: 0, Errors: 0, Skipped: 0, Time elapsed: 0.941 sec
Running org.apache.james.mailbox.inmemory.imap.SelectedStateTest
Tests run: 30, Failures: 0, Errors: 3, Skipped: 0, Time elapsed: 1.015 sec <<< FAILURE!
Location: /org/apache/james/imap/scripts/Copy.test:54
LastClientMsg: a8 FETCH 1:3 (FLAGS)
Expected: '\* 1 FETCH \(FLAGS \(\)\)'
Actual   : '* 1 FETCH (FLAGS (\Recent))'
Location: /org/apache/james/imap/scripts/Copy.test:54
LastClientMsg: a8 FETCH 1:3 (FLAGS)
Expected: '\* 1 FETCH \(FLAGS \(\)\)'
Actual   : '* 1 FETCH (FLAGS (\Recent))'
Location: /org/apache/james/imap/scripts/Copy.test:54
LastClientMsg: a8 FETCH 1:3 (FLAGS)
Expected: '\* 1 FETCH \(FLAGS \(\)\)'
Actual   : '* 1 FETCH (FLAGS (\Recent))'
Running org.apache.james.mailbox.inmemory.imap.ConcurrentSessionsTest
Tests run: 21, Failures: 0, Errors: 0, Skipped: 0, Time elapsed: 0.841 sec
Running org.apache.james.mailbox.inmemory.imap.ExpungeTest
Tests run: 3, Failures: 0, Errors: 0, Skipped: 0, Time elapsed: 0.669 sec
Running org.apache.james.mailbox.inmemory.imap.SelectedInboxTest
Tests run: 42, Failures: 0, Errors: 0, Skipped: 0, Time elapsed: 0.919 sec
Running org.apache.james.mailbox.inmemory.imap.SelectTest
Tests run: 3, Failures: 0, Errors: 0, Skipped: 0, Time elapsed: 0.62 sec
Running org.apache.james.mailbox.inmemory.imap.NonAuthenticatedStateTest
Tests run: 21, Failures: 0, Errors: 0, Skipped: 0, Time elapsed: 0.367 sec
Running org.apache.james.mailbox.inmemory.imap.FetchTest
Tests run: 24, Failures: 0, Errors: 0, Skipped: 0, Time elapsed: 1.074 sec
Running org.apache.james.mailbox.inmemory.imap.FetchBodyStructureTest
Tests run: 12, Failures: 0, Errors: 9, Skipped: 0, Time elapsed: 1.182 sec <<< FAILURE!
Location: /org/apache/james/imap/scripts/FetchSimpleBodyStructure.test:135
LastClientMsg: A14 FETCH 1 (BODY[3.HEADER])
Expected: '\* 1 FETCH \(BODY\[3\.HEADER\] \{0\}'
Actual   : '* 1 FETCH (BODY[3.HEADER] {2}'
Location: /org/apache/james/imap/scripts/FetchSimpleBodyStructure.test:135
LastClientMsg: A14 FETCH 1 (BODY[3.HEADER])
Expected: '\* 1 FETCH \(BODY\[3\.HEADER\] \{0\}'
Actual   : '* 1 FETCH (BODY[3.HEADER] {2}'
Location: /org/apache/james/imap/scripts/FetchSimpleBodyStructure.test:135
LastClientMsg: A14 FETCH 1 (BODY[3.HEADER])
Expected: '\* 1 FETCH \(BODY\[3\.HEADER\] \{0\}'
Actual   : '* 1 FETCH (BODY[3.HEADER] {2}'
Location: /org/apache/james/imap/scripts/FetchMultipartBodyStructure.test:585
LastClientMsg: A13 FETCH 1 (BODY[3.HEADER])
Expected: '\* 1 FETCH \(BODY\[3\.HEADER\] \{0\}'
Actual   : '* 1 FETCH (BODY[3.HEADER] {2}'
Location: /org/apache/james/imap/scripts/FetchMultipartBodyStructure.test:585
LastClientMsg: A13 FETCH 1 (BODY[3.HEADER])
Expected: '\* 1 FETCH \(BODY\[3\.HEADER\] \{0\}'
Actual   : '* 1 FETCH (BODY[3.HEADER] {2}'
Location: /org/apache/james/imap/scripts/FetchMultipartBodyStructure.test:585
LastClientMsg: A13 FETCH 1 (BODY[3.HEADER])
Expected: '\* 1 FETCH \(BODY\[3\.HEADER\] \{0\}'
Actual   : '* 1 FETCH (BODY[3.HEADER] {2}'
Location: /org/apache/james/imap/scripts/FetchStructureComplex.test:1420
LastClientMsg: A17 FETCH 1 (BODY[3.HEADER])
Expected: '\* 1 FETCH \(BODY\[3\.HEADER\] \{0\}'
Actual   : '* 1 FETCH (BODY[3.HEADER] {2}'
Location: /org/apache/james/imap/scripts/FetchStructureComplex.test:1420
LastClientMsg: A17 FETCH 1 (BODY[3.HEADER])
Expected: '\* 1 FETCH \(BODY\[3\.HEADER\] \{0\}'
Actual   : '* 1 FETCH (BODY[3.HEADER] {2}'
Location: /org/apache/james/imap/scripts/FetchStructureComplex.test:1420
LastClientMsg: A17 FETCH 1 (BODY[3.HEADER])
Expected: '\* 1 FETCH \(BODY\[3\.HEADER\] \{0\}'
Actual   : '* 1 FETCH (BODY[3.HEADER] {2}'
Running org.apache.james.mailbox.inmemory.imap.FetchHeadersTest
Tests run: 6, Failures: 0, Errors: 0, Skipped: 0, Time elapsed: 0.778 sec
Running org.apache.james.mailbox.inmemory.imap.EventTest
Tests run: 3, Failures: 0, Errors: 0, Skipped: 0, Time elapsed: 0.599 sec
Running org.apache.james.mailbox.inmemory.imap.PartialFetchTest
Tests run: 12, Failures: 0, Errors: 0, Skipped: 0, Time elapsed: 1.05 sec

Results :

Tests in error: 

Tests run: 1158, Failures: 0, Errors: 66, Skipped: 0

mojoFailed org.apache.maven.plugins:maven-surefire-plugin:2.7.2(default-test)
[JENKINS] Recording test results
projectFailed org.apache.james:apache-james-mailbox-integration-tester:0.2-M2-SNAPSHOT
[JENKINS] Archiving <https://hudson.apache.org/hudson/job/mailbox-integration-tests/ws/pom.xml>
to /home/hudson/hudson/jobs/mailbox-integration-tests/modules/org.apache.james$apache-james-mailbox-integration-tester/builds/2011-04-12_01-28-28/archive/org.apache.james/apache-james-mailbox-integration-tester/0.2-M2-SNAPSHOT/pom.xml
sessionEnded
[INFO] ------------------------------------------------------------------------
[INFO] BUILD FAILURE
[INFO] ------------------------------------------------------------------------
[INFO] Total time: 7:34.615s
[INFO] Finished at: Mon Apr 11 17:36:14 GMT-08:00 2011
[INFO] Final Memory: 17M/145M
[INFO] ------------------------------------------------------------------------
maven builder waiting
mavenExecutionResult exceptions not empty
org.apache.maven.lifecycle.LifecycleExecutionException: Failed to execute goal org.apache.maven.plugins:maven-surefire-plugin:2.7.2:test
(default-test) on project apache-james-mailbox-integration-tester: There are test failures.

Please refer to <https://hudson.apache.org/hudson/job/mailbox-integration-tests/ws/target/surefire-reports>
for the individual test results.
	at org.apache.maven.lifecycle.internal.MojoExecutor.execute(MojoExecutor.java:213)
	at org.apache.maven.lifecycle.internal.MojoExecutor.execute(MojoExecutor.java:153)
	at org.apache.maven.lifecycle.internal.MojoExecutor.execute(MojoExecutor.java:145)
	at org.apache.maven.lifecycle.internal.LifecycleModuleBuilder.buildProject(LifecycleModuleBuilder.java:84)
	at org.apache.maven.lifecycle.internal.LifecycleModuleBuilder.buildProject(LifecycleModuleBuilder.java:59)
	at org.apache.maven.lifecycle.internal.LifecycleStarter.singleThreadedBuild(LifecycleStarter.java:183)
	at org.apache.maven.lifecycle.internal.LifecycleStarter.execute(LifecycleStarter.java:161)
	at org.apache.maven.DefaultMaven.doExecute(DefaultMaven.java:319)
	at org.apache.maven.DefaultMaven.execute(DefaultMaven.java:156)
	at org.jvnet.hudson.maven3.launcher.Maven3Launcher.main(Maven3Launcher.java:79)
	at sun.reflect.NativeMethodAccessorImpl.invoke0(Native Method)
	at sun.reflect.NativeMethodAccessorImpl.invoke(NativeMethodAccessorImpl.java:39)
	at sun.reflect.DelegatingMethodAccessorImpl.invoke(DelegatingMethodAccessorImpl.java:25)
	at java.lang.reflect.Method.invoke(Method.java:592)
	at org.codehaus.plexus.classworlds.launcher.Launcher.launchStandard(Launcher.java:329)
	at org.codehaus.plexus.classworlds.launcher.Launcher.launch(Launcher.java:239)
	at org.jvnet.hudson.maven3.agent.Maven3Main.launch(Maven3Main.java:146)
	at hudson.maven.Maven3Builder.call(Maven3Builder.java:124)
	at hudson.maven.Maven3Builder.call(Maven3Builder.java:71)
	at hudson.remoting.UserRequest.perform(UserRequest.java:114)
	at hudson.remoting.UserRequest.perform(UserRequest.java:48)
	at hudson.remoting.Request$2.run(Request.java:270)
	at java.util.concurrent.Executors$RunnableAdapter.call(Executors.java:417)
	at java.util.concurrent.FutureTask$Sync.innerRun(FutureTask.java:269)
	at java.util.concurrent.FutureTask.run(FutureTask.java:123)
	at java.util.concurrent.ThreadPoolExecutor$Worker.runTask(ThreadPoolExecutor.java:651)
	at java.util.concurrent.ThreadPoolExecutor$Worker.run(ThreadPoolExecutor.java:676)
	at java.lang.Thread.run(Thread.java:595)
Caused by: org.apache.maven.plugin.MojoFailureException: There are test failures.

Please refer to <https://hudson.apache.org/hudson/job/mailbox-integration-tests/ws/target/surefire-reports>
for the individual test results.
	at org.apache.maven.plugin.surefire.SurefireHelper.reportExecution(SurefireHelper.java:74)
	at org.apache.maven.plugin.surefire.SurefirePlugin.execute(SurefirePlugin.java:642)
	at org.apache.maven.plugin.DefaultBuildPluginManager.executeMojo(DefaultBuildPluginManager.java:101)
	at org.apache.maven.lifecycle.internal.MojoExecutor.execute(MojoExecutor.java:209)
	... 27 more
Maven failed with error.
Sending e-mails to: server-dev@james.apache.org
channel stopped


---------------------------------------------------------------------
To unsubscribe, e-mail: server-dev-unsubscribe@james.apache.org
For additional commands, e-mail: server-dev-help@james.apache.org


Mime
View raw message