jakarta-jcs-users mailing list archives

Site index · List index
Message view « Date » · « Thread »
Top « Date » · « Thread »
From Neil Avery <NAv...@thoughtworks.com>
Subject RE: JCS CVS Tag: What is the tag for the last Released Version + Jun it failure in MAIN tag
Date Tue, 22 Jul 2003 15:29:22 GMT
Hi Jeff,
If you look through the mail archive you find mention of the junit disk 
test failing due to OutOfMemory. You should be using cvs  HEAD which it 
looks like you already are.
n.





"Anderson, Jeff" <Jeff.Anderson@webmd.net>
22/07/2003 16:17
Please respond to "Turbine JCS Users List"

 
        To:     "'Turbine JCS Users List'" <turbine-jcs-user@jakarta.apache.org>
        cc: 
        Subject:        RE: JCS CVS Tag:  What is the tag for the last Released Version +
Jun it 
failure in MAIN tag


I have also encountered the junit failure and posted a message about it on
July 11.  I haven't gotten any responses about it to date.  If anyone has
resolved this, please post.

Thanks,
Jeff

-----Original Message-----
From: Ashok Natesan [mailto:ANatesan@ariba.com]
Sent: Monday, July 21, 2003 8:34 PM
To: 'turbine-jcs-user@jakarta.apache.org'
Subject: JCS CVS Tag: What is the tag for the last Released Version +
Jun it failure in MAIN tag


Hi,

 

I was able to pull the JCS source from
http://jakarta.apache.org/site/cvsindex.html

With the settings/cmd below

 

CVSROOT=:pserver:anoncvs@cvs.apache.org:/home/cvspublic

cvs co jakarta-turbine-jcs

 

This is pulling the MAIN tag, I assume.

 

What is the tag of the last "production" released version that I should be
pulling from.  Other tags I see are HEAD, JCS_1_0 and JAKARTA.

 

The same question was asked in another old thread "where
<http://archives.apache.org/eyebrowse/ReadMsg?listName=turbine-jcs-user@jaka
rta.apache.org&msgNo=91>  to get JCS from" & I never did see a response 
for
that.

 

I was able to build JCS with MAVEN.  Other than the JUNIT failure below,
things seemed to go ok.

 

Also FYI,  the MAIN tag seems to have a JUNIT failure,

 

test:test:

    [junit] Running org.apache.jcs.TestDiskCache

    [junit] Tests run: 3, Failures: 0, Errors: 0, Time elapsed: 6.85 sec

    [junit] Running org.apache.jcs.TestDiskCacheConcurrent

    [junit] java.lang.OutOfMemoryError

    [junit]     <<no stack trace available>>

    [junit] Exception in thread "main"

    [junit] [ERROR] TEST org.apache.jcs.TestDiskCacheConcurrent FAILED

    [junit] Running org.apache.jcs.TestJCS

    [junit] Tests run: 1, Failures: 0, Errors: 0, Time elapsed: 0.581 sec

    [junit] Running org.apache.jcs.TestSimpleLoad

    [junit] Tests run: 1, Failures: 0, Errors: 0, Time elapsed: 6.399 sec

    [junit] Running org.apache.jcs.TestTCPLateralCache

    [junit] Tests run: 1, Failures: 0, Errors: 0, Time elapsed: 2.444 sec

 

BUILD FAILED

File...... file:/C:/Documents and
Settings/anatesan/.maven/plugins/maven-test-pl

ugin-1.3/

Element... fail

Line...... 99

Column.... 54

There were test failures.

Total time:  36 seconds

 

I haven't debugged into the failure yet..  Is this a known problem?  Thx.

 

Ashok

 

 

 


---------------------------------------------------------------------
To unsubscribe, e-mail: turbine-jcs-user-unsubscribe@jakarta.apache.org
For additional commands, e-mail: turbine-jcs-user-help@jakarta.apache.org




Mime
  • Unnamed multipart/alternative (inline, None, 0 bytes)
View raw message