jakarta-jcs-users mailing list archives

Site index · List index
Message view « Date » · « Thread »
Top « Date » · « Thread »
From Les Hazlewood <lhazlew...@transdynatlanta.com>
Subject RE: JCS Code/Binary
Date Tue, 20 May 2003 19:33:18 GMT
I searched through the mail archives and figured out how to build JCS.

Someone should seriously contemplate putting this information on the website
under a "download" link in the navigational menu to the left (in conjunction
with most other apache/jakarta projects.

Anyway,

I downloaded and installed maven-1.0-beta-9.

I tried to build JCS with maven, and although the classes compiled fine, the
test target failed (and thus the whole build failed).  The output for the
build is at the end of this email.

I'm going to jar up the classes and make my own jar so I can use JCS, but
you folks should know that it doesn't build properly because of
discrepancies in the test target.  This could be because of maven
1.0-beta-9, but I don't think so, due to the error messages.

Thanks again,

Les Hazlewood

The exact (complete) output is as follows:

-----------------------------

C:\development\jakarta-turbine-jcs>maven
 __  __
|  \/  |__ Jakarta _ ___
| |\/| / _` \ V / -_) ' \  ~ intelligent projects ~
|_|  |_\__,_|\_/\___|_||_|  v. 1.0-beta-9-SNAPSHOT


Attempting to download commons-configuration-1.0-dev.jar.
..
.
Attempting to download commons-logging-1.0.2.jar.
....
.
Attempting to download commons-lang-1.0.jar.
.....
.
Attempting to download concurrent-1.0.jar.
............
.
Attempting to download hsqldb-1.7.0.jar.
........
.
Attempting to download log4j-1.1.3.jar.
.....
.
Attempting to download servletapi-2.2.jar.
..
.
Attempting to download javagroups-2.0.jar.
...................................
.
Attempting to download jisp-1.0.2.jar.
..
.
Attempting to download tomcat-util-3.2.1.jar.
....................
.
Attempting to download velocity-1.3-dev.jar.
.............
.
Attempting to download junit-3.7.jar.
....
.
Attempting to download xmlrpc-1.1.jar.
..
.
Attempting to download xml-apis-2.0.2.jar.
....
.
Attempting to download xercesImpl-2.0.2.jar.
..................................
.
Attempting to download ant-1.5.1.jar.
..........................
.
Attempting to download dom4j-1.4-dev-7.jar.
..................
.
Attempting to download commons-jelly-20030211.141339.jar.
.......
Attempting to download commons-jelly-tags-validate-20030211.143411.jar.
..
Attempting to download commons-jelly-tags-xml-20030211.142705.jar.
.....
Attempting to download junit-3.8.1.jar.
.........
.
Attempting to download maven.jar.
.....
.
Attempting to download xml-apis-1.0.b2.jar.
.....
.
Attempting to download isorelax-20020414.jar.
......
.
Attempting to download msv-20020414.jar.
........................................
.
Attempting to download relaxngDatatype-20020414.jar.
..
.
Attempting to download dom4j-1.4-dev-8.jar.
..................
.
Attempting to download commons-grant-1.0-beta-4.jar.
..
.
Attempting to download commons-jelly-tags-jsl-20030211.143151.jar.
..
Attempting to download commons-jelly-tags-log-20030211.142821.jar.
..
Attempting to download commons-jelly-tags-velocity-20030303.205659.jar.
..
Attempting to download velocity-1.3.jar.
...................
.
Attempting to download velocity-dvsl-0.45.jar.
..
.
Attempting to download xerces-2.0.2.jar.
......................................
.
Attempting to download commons-jelly-tags-antlr-20030211.143720.jar.
..
Attempting to download commons-lang-1.0-b1.1.jar.
....
.
Attempting to download antlrall-2.7.1.jar.
................
.
Attempting to download clover-1.0.jar.
.......
.
java:prepare-filesystem:
    [mkdir] Created dir: C:\development\jakarta-turbine-jcs\target\classes

java:compile:
    [javac] Since fork is true, ignoring compiler setting.
    [javac] Compiling 165 source files to
C:\development\jakarta-turbine-jcs\tar
get\classes
    [javac] Since fork is true, ignoring compiler setting.
    [javac] Note: Some input files use or override a deprecated API.
    [javac] Note: Recompile with -deprecation for details.

java:jar-resources:

test:prepare-filesystem:
    [mkdir] Created dir:
C:\development\jakarta-turbine-jcs\target\test-classes
    [mkdir] Created dir:
C:\development\jakarta-turbine-jcs\target\test-reports

test:test-resources:

test:compile:
    [javac] Compiling 13 source files to
C:\development\jakarta-turbine-jcs\targ
et\test-classes
Note:
C:\development\jakarta-turbine-jcs\src\test\org\apache\jcs\TestSimpleLoad.
java uses or overrides a deprecated API.
Note: Recompile with -deprecation for details.

test:test:
    [mkdir] Created dir:
C:\development\jakarta-turbine-jcs\target\test-sandbox\logs
    [copy] Copying 6 files to
C:\development\jakarta-turbine-jcs\target\test-classes
    [junit] Running org.apache.jcs.TestDiskCache
    [junit] Tests run: 3, Failures: 0, Errors: 0, Time elapsed: 6.438 sec
    [junit] Running org.apache.jcs.TestDiskCacheConcurrent
    [junit] java.lang.OutOfMemoryError
    [junit] Exception in thread "main"
    [junit] [ERROR] TEST org.apache.jcs.TestDiskCacheConcurrent FAILED
    [junit] Running org.apache.jcs.TestJCS
    [junit] Tests run: 1, Failures: 0, Errors: 0, Time elapsed: 0.64 sec
    [junit] Running org.apache.jcs.TestSimpleLoad
    [junit] Tests run: 1, Failures: 0, Errors: 0, Time elapsed: 5.906 sec
    [junit] Running org.apache.jcs.TestTCPLateralCache
    [junit] Tests run: 1, Failures: 0, Errors: 0, Time elapsed: 3.453 sec

BUILD FAILED
There were test failures.
Total time: 2 minutes 29 seconds

Mime
  • Unnamed multipart/alternative (inline, None, 0 bytes)
View raw message