jakarta-jcs-users mailing list archives

Site index · List index
Message view « Date » · « Thread »
Top « Date » · « Thread »
From Mohamed Ali Sfaxi <mohamed.sf...@epfl.ch>
Subject builing JCS
Date Fri, 25 Apr 2003 16:29:53 GMT
hi,
i'm starting with jcs and when i tryed to build jcs with maven : i got 
the following error  :
"
test:compile:

test:test:
   [junit] Running org.apache.jcs.TestDiskCache
   [junit] Tests run: 3, Failures: 0, Errors: 0, Time elapsed: 4.953 sec
   [junit] Running org.apache.jcs.TestDiskCacheConcurrent
   [junit] Tests run: 3, Failures: 2, Errors: 0, Time elapsed: 5.843 sec
   [junit] java.lang.OutOfMemoryError
   [junit] Exception in thread "main"
   [junit] [ERROR] TEST org.apache.jcs.TestDiskCacheConcurrent FAILED
   [junit] Running org.apache.jcs.TestJCS
   [junit] Tests run: 1, Failures: 0, Errors: 0, Time elapsed: 0.578 sec
   [junit] Running org.apache.jcs.TestSimpleLoad
   [junit] Tests run: 1, Failures: 0, Errors: 0, Time elapsed: 4.656 sec
   [junit] Running org.apache.jcs.TestTCPLateralCache
   [junit] Tests run: 1, Failures: 0, Errors: 0, Time elapsed: 2.391 sec

BUILD FAILED
There were test failures.
"

how can I solve this error , please
thank you in advance
Dali



Mime
View raw message